{"text_format":"1","workbook":"xlsx","n_sheets":26,"sheets":["Letter","Start_Here","Cover_Letter","Specialty","5700","5680","T1_T1B","T2","T300","T300e","T5e","T5","T7","T16","T12","M17","Pricezones","PricezonesUsers","Contact","Help","Lists","TennantTrue Rate","County Tier","Settings","Financing","Macro"],"not_rendered":{"charts":0,"images":16,"macros":1,"external_links":0,"defined_names":151,"comments":2,"pivot_tables":0},"unopened":[{"sheet":"Macro","index":25,"reason":"part_missing"}],"bounds":{"document_bytes":16777216,"sheet_cells":100000,"rows_first":2000,"rows_last":500,"rows_between":2000,"halvings":0,"cell_chars":16384,"cell_head_chars":4096},"cells_cut":0,"cells_raw":0,"read":"whole","date_system":"1900"}

{"sheet":"Letter","index":0,"n_rows":37,"n_cols":4,"rows_kept":37,"cut":false,"hidden":true,"merged":[]}
[]
["Important!!"]
["If you accidentally stumbled into this page do not change any information on this page."]
[]
["Contact Name",null,"Contact Name"]
["Company Name",null,"Company Name"]
["Address",null,"Address"]
["City, State Zip",null,"City, State Zip"]
["Dear ",null,"Dear "]
["Rep Name",null,"Rep Name"]
["Contact Phone",null,"Contact Phone"]
[null,null,"Sap ID"]
[null,null,"Cust grp 3"]
["Date",null,"Date"]
[]
[{"$f":"LEN(Salutation)","v":5},null,"// Number of chars in Salutation string"]
[{"$f":"FIND(\" \",Salutation,1)","v":5},null,"// Location of first \"blank space\" in the Salutation string"]
[{"$f":"LEFT(Salutation,A17-1)","v":"Dear"},null,"// Text to the left of the \"blank space\" in the Salutation string (Actual Salutation)"]
[{"$f":"IF(A16=A17, \"No Contact From SA\", LEFT(RIGHT(Salutation,A16-A17), A16-A17-2))","v":"No Contact From SA"},null,"// Text to the right of the \"blank space\" in the Salutation string"]
[{"$f":"IF(A16=A17, \"formal\", IF(A5 = A19, \"formal\", \"informal\"))","v":"formal"},null,"//Determines whether the letter is formal or informal.  If there was no contact from SA then the letter is assumed to be formal"]
[]
[{"$f":"Start_Here!$C$8&\", \"","v":"Contact Name, "},null,"// Get the Contact name form Start_Here to make check whether the rep changed it or not and concat a \", \""]
[{"$f":"FIND(\" \",A22,1)","v":8},null,"//Get the first blank space of the contact name from Start_Here.  This will be used in the informal letter to derive the first name."]
["Please do not change cell A25."]
["2014-10-02","Quote Date"]
[{"$f":"LEFT(A22,A23-1)","v":"Contact"},null,"// Contact name form start here.  This is only the First name if there is a first and last name"]
[]
[{"$f":"IF(A22 = \", \", \"Good Morning,\", IF(A22 = 0, \"Good Morning,\", IF(A9 = \"Good Morning, \", \"Good Morning, \", IF(A5=A22,Letter!$A$9, IF(A20 = \"informal\", \"Dear \"&A26&\",\", \"Dear \"&A22)))))","v":"Dear Contact Name, "},null,"//creates the salutation: "]
[null,null,"1:  Check to see if there is a contact specified in Start_here, if not then Good Morning is used"]
[null,null,"2:  Same as case one, except this will be the case from SA since the cell will have a 0 value if there was no Contact specified."]
[null,null,"3:  Check to see if \"Good Morning\" was the original greeting, if so, then use Good Morning for the letter no Matter What."]
[null,null,"4:  Check whether the Contact name has been changed.  If so then use the original SA salutation"]
[null,null,"5:  If the Contact name has been changed then, check whether the letter was origninaly a formal letter or an informal letter:"]
[null,null,null,"5a:  If informal use the first name which will reside in cell a20"]
[null,null,null,"5b:  if formal use the the whole name which is in cell a 18"]
["Equipment Type","Scrubber"]
["Country","Canada"]

{"sheet":"Start_Here","index":1,"n_rows":58,"n_cols":17,"rows_kept":58,"cut":false,"hidden":false,"merged":[[0,2,0,5],[25,2,29,2]]}
["Distributor",null,"Please fill out as much buyer information as you can.  Overkey addresses and contacts for proper display on the machine sheets.",null,null,null,null,null,null,null,null,null,null,null,"Alabama","Discount","ALL OTHER COUNTIES"]
[null,null,null,null,null,null,null,null,null,null,null,null,null,null,"Alberta",{"$f":"TTDiscountLow","v":0},"BARBOUR"]
["Buyer Information",null,null,null,null,null,null,null,null,null,null,null,null,null,"Arkansas",{"$f":"TTDiscountHigh","v":5},"COVINGTON"]
[null,"CRM Address Information ",null,null,null,"Customer Number",null,null,null,null,null,null,null,null,"Arizona",null,"DALE"]
[null,"Company",{"$f":"CompanyName","v":"Company Name"},null,null,{"$f":"Letter!$A$12","v":0},null,null,null,null,null,null,null,null,"British Columbia",null,"ESCAMBIA"]
[null,"Address",{"$f":"Address","v":"Address"},null,null,null,null,null,null,null,null,null,null,null,"California",null,"GENEVA"]
[null,"City, State Zip",{"$f":"CityStateZip","v":"City, State Zip"},null,null,"Authorized Buyer's Name",null,null,null,null,null,null,null,null,"Colorado",null,"HENRY"]
[null,"Name",{"$f":"ContactName","v":"Contact Name"},null,null,null,null,null,null,null,null,null,null,null,"Connecticut",null,"HOUSTON"]
[null,"Phone",{"$f":"Letter!$A$11","v":"Contact Phone"},null,null,null,null,null,null,null,null,null,null,null,"District of Columbia",null,"LEE"]
[null,null,null,null,null,"Buyer's Phone #",null,null,null,null,null,null,null,null,"Delaware",null,"RUSSELL"]
[null,"Ship To Information (Please Verify)",null,"No",null,null,null,null,null,null,null,null,null,null,"Florida"]
[null,"Company",{"$f":"IF($D11=\"Yes\", $C5,\"\")","v":""},null,null,null,null,null,null,null,null,null,null,null,"Georgia"]
[null,"Address",{"$f":"IF($D11=\"Yes\", $C6,\"\")","v":""},null,null,"Requested Delivery Date",null,null,null,null,null,null,null,null,"Hawaii"]
[null,"City, State Zip",{"$f":"IF($D11=\"Yes\", $C7,\"\")","v":""},null,null,null,null,null,null,null,null,null,null,null,"Iowa"]
[null,"Name",{"$f":"IF($D11=\"Yes\", $C8,\"\")","v":""},null,null,"Cust Grp 3",null,null,null,null,null,null,null,null,"Idaho"]
[null,"Phone",{"$f":"IF($D11=\"Yes\", $C9,\"\")","v":""},null,null,{"$f":"Letter!$A$13","v":0},null,null,null,null,null,null,null,null,"Illinois"]
[null,null,null,null,null,null,null,null,null,null,null,null,null,null,"Indiana"]
[null,"Sold To Information (Please Verify)",null,"No",null,"Finance Partner",null,null,null,null,null,null,null,null,"Kansas"]
[null,"Company",{"$f":"IF($D18=\"Yes\", $C5,\"\")","v":""},null,null,"National Leasing",null,null,null,null,null,null,null,null,"Kentucky"]
[null,"Address",{"$f":"IF($D18=\"Yes\", $C6,\"\")","v":""},null,null,null,null,null,null,null,null,null,null,null,"Louisiana"]
[null,"City, State Zip",{"$f":"IF($D18=\"Yes\", $C7,\"\")","v":""},null,null,"TennantTrue Details",null,null,null,null,null,null,null,null,"Massachusetts"]
[null,"Name",{"$f":"IF($D18=\"Yes\", $C8,\"\")","v":""},null,null,"State",null,null,null,null,null,null,null,null,"Maryland"]
[null,"Phone",{"$f":"IF($D18=\"Yes\", $C9,\"\")","v":""},null,null,null,null,null,null,null,null,null,null,null,"Maine"]
[null,null,null,null,null,"County",null,null,null,null,null,null,null,null,"Michigan"]
[null,"Shipping/Carrier Instructions:",null,null,null,null,null,null,null,null,null,null,null,null,"Minnesota"]
[null,null,null,null,null,"National Account",null,null,null,null,null,null,null,null,"Missouri"]
[null,null,null,null,null,null,null,null,null,null,null,null,null,null,"Mississippi"]
[null,null,null,null,null,"TennantTrue Discount (%)",null,null,null,null,null,null,null,null,"Montana"]
[null,null,null,null,null,null,null,null,null,null,null,null,null,null,"North Carolina"]
[null,null,null,null,null,null,null,null,null,null,null,null,null,null,"North Dakota"]
[null,null,null,null,null,null,null,null,null,null,null,null,null,null,"Nebraska"]
["Seller Information",null,null,null,null,null,null,null,null,null,null,null,null,null,"New Hampshire"]
[null,null,null,null,"Terms and Conditions",null,null,null,null,null,null,null,null,null,"New Jersey"]
[null,"Letter/Quote",null,null,"Ask your local sales rep for estimated lead times. Verify when placing order",null,null,null,null,null,null,null,null,null,"New Mexico"]
[null,"Company","Tennant Sales and Service Company",null,"All orders subject to acceptance by Tennant Sales and Service Company, Minneapolis, Minnesota",null,null,null,null,null,null,null,null,null,"Nevada"]
[null,"Address","701 North Lilac Drive",null,"Prices subject to change without notice. Subject to any applicable taxes.",null,null,null,null,null,null,null,null,null,"New York"]
[null,null,"P O Box 1452",null,"Terms:  Net 30 days.  Payable in Canadian Funds",null,null,null,null,null,null,null,null,null,"Ohio"]
[null,null,"Minneapolis, MN 55440-1452",null,"Freight:  Accessories, parts, supplies, detergents, and floor coatings orders delivered DDP ",null,null,null,null,null,null,null,null,null,"Oklahoma"]
[null,"Name",{"$f":"RepName","v":"Rep Name"},null,"shipping point Frt PPD.  Machine orders delivered DDP shipping point Frt PPD and add.",null,null,null,null,null,null,null,null,null,"Ontario"]
[null,null,null,null,"Returned Merchandise is subject to a restocking fee.",null,null,null,null,null,null,null,null,null,"Oregon"]
[null,"Phone","800-553-8033",null,"All orders are subject to Tennant’s General Terms and Conditions available at http://www.tennantco.com/terms.",null,null,null,null,null,null,null,null,null,"Pennsylvania"]
[null,"Fax","763-513-2116",null,"Printed General Terms and Conditions are also available upon request.",null,null,null,null,null,null,null,null,null,"Rhode Island"]
[null,null,null,null,null,null,null,null,null,null,null,null,null,null,"Quebec"]
[null,"Footer",null,null,null,null,null,null,null,null,null,null,null,null,"South Carolina"]
[null,"Line 1","TENNANT · 701 NORTH LILAC DRIVE · P.O. BOX 1452 · MINNEAPOLIS, MN 55440-1452 ·",null,null,null,null,null,null,null,null,null,null,null,"South Dakota"]
[null,"Line 2"," PHONE:800-553-8033 · FAX:763-513-2116",null,null,null,null,null,null,null,null,null,null,null,"Tennessee"]
[null,null,null,null,null,null,null,null,null,null,null,null,null,null,"Texas"]
[null,null,null,null,null,null,null,null,null,null,null,null,null,null,"Utah"]
[null,null,null,null,null,null,null,null,null,null,null,null,null,null,"Virginia"]
[null,null,null,null,null,null,null,null,null,null,null,null,null,null,"Vermont"]
[null,null,null,null,null,null,null,null,null,null,null,null,null,null,"Washington"]
[null,null,null,null,null,null,null,null,null,null,null,null,null,null,"Wisconsin"]
[null,null,null,null,null,null,null,null,null,null,null,null,null,null,"West Virginia"]
[null,null,null,null,null,null,null,null,null,null,null,null,null,null,"Wyoming"]
[null,null,"Battery Surcharge","Price"]
[null,null,"36 Volt Machines",0]
[null,null,"24 Volt Machines",0]
[null,null,"Small 24 Volt Machines",0]

{"sheet":"Cover_Letter","index":2,"n_rows":37,"n_cols":1,"rows_kept":37,"cut":false,"hidden":false,"merged":[]}
[{"$f":"Letter!$A$25","v":"2014-10-02"}]
[]
[]
[{"$f":"Start_Here!C35","v":"Tennant Sales and Service Company"}]
[{"$f":"Start_Here!C36","v":"701 North Lilac Drive"}]
[{"$f":"Start_Here!C38","v":"Minneapolis, MN 55440-1452"}]
[]
[]
[{"$f":"Start_Here!$C$8","v":"Contact Name"}]
[{"$f":"Start_Here!C5","v":"Company Name"}]
[{"$f":"Start_Here!C6","v":"Address"}]
[{"$f":"Start_Here!C7","v":"City, State Zip"}]
[]
[]
[{"$f":"Salutation","v":"Dear "}]
[]
["Thank you for your interest in TENNANT maintenance equipment.  We are pleased to send you the attached quotation and literature on the products you are considering."]
[]
["A variety of lease and finance programs are available that will allow you to maximize the cost savings and productivity advantages that Tennant provides."]
[]
["I will be in contact with you, but in the meantime, feel free to call my sales office listed below, should you need to--your questions are invited and your orders will be given prompt attention."]
[]
["Yours Truly,"]
[]
["                                                                                                                "]
["                                                                                                                "]
[{"$f":"Start_Here!$C$39","v":"Rep Name"}]
[{"$f":"Start_Here!C35","v":"Tennant Sales and Service Company"}]
[{"$f":"Start_Here!C36","v":"701 North Lilac Drive"}]
[{"$f":"Start_Here!C37","v":"P O Box 1452"}]
[{"$f":"Start_Here!C38","v":"Minneapolis, MN 55440-1452"}]
[]
["attachment"]
[]
[]
[{"$f":"Start_Here!C45","v":"TENNANT · 701 NORTH LILAC DRIVE · P.O. BOX 1452 · MINNEAPOLIS, MN 55440-1452 ·"}]
[{"$f":"Start_Here!C46","v":" PHONE:800-553-8033 · FAX:763-513-2116"}]

{"sheet":"Specialty","index":3,"n_rows":195,"n_cols":14,"rows_kept":195,"cut":false,"hidden":false,"merged":[[93,3,93,4],[93,5,93,6],[0,2,0,3],[1,2,1,3],[2,2,2,3],[3,2,3,3],[94,3,94,4],[94,5,94,6],[95,3,95,4],[95,5,95,6],[96,3,96,4],[96,5,96,6],[97,3,97,4],[97,5,97,6],[98,3,98,4],[98,5,98,6],[101,4,101,8],[103,3,103,6],[105,3,105,4],[106,3,106,4],[108,3,108,4],[108,5,108,6],[108,7,108,8],[109,3,109,4],[109,5,109,6],[109,7,109,8],[110,3,110,4],[110,5,110,6],[110,7,110,8],[111,3,111,4],[111,5,111,6],[111,7,111,8],[112,3,112,4],[112,5,112,6],[112,7,112,8],[113,3,113,4],[113,5,113,6],[113,7,113,8],[114,3,114,4],[114,5,114,6],[114,7,114,8],[115,3,115,4],[115,5,115,6],[115,7,115,8],[116,3,116,4],[116,5,116,6],[116,7,116,8],[121,2,121,6],[140,4,140,6],[142,2,142,5],[143,2,143,5],[144,2,144,5],[145,2,145,5],[146,2,146,5],[148,2,148,5],[149,2,149,5],[150,2,150,5],[151,2,151,5],[152,2,152,5],[154,4,154,6],[158,2,158,4],[167,4,167,5]]}
["Specialty",null,{"$f":"Start_Here!$C$8","v":"Contact Name"}]
[null,null,{"$f":"Start_Here!$C$5","v":"Company Name"}]
[null,null,{"$f":"Start_Here!$C$6","v":"Address"}]
[null,null,{"$f":"Start_Here!$C$7","v":"City, State Zip"}]
[null,null,{"$f":"Start_Here!$C$39","v":"Rep Name"}]
[null,null,{"$f":"Start_Here!$C$35","v":"Tennant Sales and Service Company"}]
[null,null,{"$f":"Start_Here!$C$36","v":"701 North Lilac Drive"}]
[null,null,{"$f":"Start_Here!$C$38","v":"Minneapolis, MN 55440-1452"}]
[null,null,{"$f":"Start_Here!$C$41","v":"800-553-8033"},null,"Quote Date :",null,{"$f":"Letter!$A$25","v":"2014-10-02"}]
[]
[]
[null,null,"EXCLUSIVE FACTORY-DIRECT WARRANTY"]
[null,null,"  Q12"]
[null,null,"       2 YEARS PARTS or 2500 hrs "]
[null,null,"       1 YEAR LABOR"]
[null,null,"       90 DAYS TRAVEL"]
[null,null,"BLOWER"]
[null,null,"12 MONTHS ON PARTS / LABOR (Blower)"]
[null,null,"ASC15",null,"                Quote Request Information"]
[null,null,"36 MONTHS",null,null,null,"Fax (quote only)"]
[null,null,"36 MONTHS – LABOR",null,null,null,"Mail (quote,lit, specs)"]
[null,null,"NO TRAVEL",null,null,null,"Fax + Mail"]
[]
[]
[null,null,"Description","Reference No.","Canada Price","Qty.","Extended Price"]
[null,null,null,null,null,"*"]
[null,null,"Q12 Multi-Surface Cleaner",null,null,{"$f":"SUM(F33:F34)","v":0},null,null,null,null,null,{"$f":"SUM(F27)","v":0},"Surcharge Qty"]
[null,null,"15 gal (57 L) capacity, variable 400-1200 psi (27.6 to 83 bar), Hard Surface Turbo Tool option, 25 ft (8 m) vacuum and solution hoses, and two 40 ft (12 m) hospital grade safety yellow electrical cords. ",null,null,{"$f":"SUM(F27)","v":0},null,null,null,null,null,0,"Surcharge Qty"]
[null,null,"ETL (US/C) certified to UL & CSA Standards. ",null,null,{"$f":"SUM(F28)","v":0},null,null,null,null,null,0,"Surcharge Qty"]
[null,null,"Boxed Dimensions:  28.5 in x 38 in x 55 in (724 mm x 965 mm x 1397 mm)",null,null,{"$f":"SUM(F29)","v":0},null,null,null,null,null,0,"Surcharge Qty"]
[null,null,"Shipping Weight:  205 lb (93 kg)",null,null,{"$f":"SUM(F30)","v":0},null,null,null,null,null,0,"Surcharge Qty"]
[null,null,null,null,null,null,null,null,null,null,null,0,"Surcharge Qty"]
[null,null,"Q12, 400-1200 psi (27.6 to 83 bar) Multi-Surface Cleaner w/ vacuum and solution hoses.",1072856,9518,null,{"$f":"F33*E33","v":0},null,null,null,null,0,"Surcharge Qty"]
[null,null,"Q12, 400-1200 psi (27.6 to 83 bar) Multi-Surface Cleaner w/ hard surface turbo tool, vacuum, and solution hoses.",9011458,11609,null,{"$f":"F34*E34","v":0},null,null,null,null,0,"Surcharge Qty"]
[null,null,null,null,null,null,null,null,null,null,null,0,"Surcharge Qty"]
[null,"Aftermarket Accessories for Model Q12",null,null,null,{"$f":"SUM(F37:F53)","v":0},null,null,null,null,null,0,"Surcharge Qty"]
[null,null,"Hard Surface Tool (for cleaning grout and tile)",1073134,2488.4,null,{"$f":"F37*E37","v":0},null,null,null,null,{"$f":"SUM(F37)","v":0},"Surcharge Qty"]
[null,null,"Hard Surface Hand Tool (for cleaning walls)",1210534,1219.4000000000001,null,0,null,null,null,null,{"$f":"SUM(F38)","v":0},"Surcharge Qty"]
[null,null,"Corner Tool ",1210535,1298.5,null,0,null,null,null,null,{"$f":"SUM(F39)","v":0},"Surcharge Qty"]
[null,null,"Upholsery Tool (best used with 100-500 PSI (6.9-34 bar)",1210536,338.3,null,0,null,null,null,null,0,"Surcharge Qty"]
[null,null,"13\" (330mm) High Air Flow Titanium Carpet wand - 2 Unijet system",1071320,1244.2,null,{"$f":"F41*E41","v":0}]
[null,null,"13\"(330mm) Stainless Steel Carpet wand- 2 Unijets System ",1073125,878.3,null,{"$f":"F42*E42","v":0}]
[null,null,"Hard Surface Cleaner (Qty 4)",9012084,222.5,null,0,null,null,null,null,0,"Surcharge Qty"]
[null,null,"Powder Defoamer Detergent (Qty 4)",9012083,344.4,null,0,null,null,null,null,0,"Surcharge Qty"]
[null,null,"Pressure Hose Replacement Kit, 25 ft (8 m)",9011772,525.6,null,0]
[null,null,"Vacuum Hose Replacement Kit, 25 ft (8 m)",9011773,187.5,null,0]
[null,null,"Hose Assembly Kit (Pressure Hose and Vacuum Hose, 25 ft (8 m)",9011775,704.2,null,0]
[null,null,"Hose Bag to store hoses and hand tools - nylon mesh with pull string closure.",220040,34.299999999999997,null,0]
[null,null,"Hose Strap",9011922,31,null,0]
[null,null,"Pump-up Sprayer - 2 gal (8 L) ",605848,199.7,null,0]
[null,null,"Spray Jet Tool for easy removal of jets",230521,16.3,null,0]
[null,null,"Power Cord 12/3 SJTOW Yellow 105C",9011769,314.8,null,0]
[null,null,"Filter Bag (assists with reducing filter clogs)",9012438,45.1,null,0]
[]
[null,null,null,null,null,{"$f":"SUM(F56)","v":0}]
[null,null,"ASC-15  All Surface Cleaner ",9007449,6055,null,{"$f":"F56*E56","v":0}]
[null,null,"15-gal. (57L) solution capacity 19-gal. (72L) recovery capacity.  Includes double-bend telescopic aluminum wand, 25-ft. (7.6m) recovery hose, scrub brush, standard 6-ft. (1.8m) to 25-ft. (7.6m) expandable blower hose, 25-ft. (7.6m) high pressure hose with variable pressure gun, floor squeegee tool, hand squeegee tool, blower tool, gulper floor drain tool, fill hose and metering tip packet with 3 different dilution ratio tips.  ",null,null,{"$f":"SUM(F56)","v":0}]
[null,null,"Boxed dimensions:  45L x 22.25W x 42H (1143mm x 565mm x 1067mm)",null,null,{"$f":"SUM(F57)","v":0}]
[null,null,"Shipping Weight: 190 lbs. (86 kg) / Cu. Ft.: 19 (Cu.M. .54)",null,null,{"$f":"SUM(F58)","v":0}]
[]
[null,"Accessories for ASC-15",null,null,null,{"$f":"SUM(F62:F72)","v":0}]
[null,null,"6-ft. to 25-ft. Expandable Grey Blower Hose",1010410,119.5,null,{"$f":"F62*E62","v":0}]
[null,null,"Double Bend Telescopic Aluminum Wand",1010457,252.9,null,0]
[null,null,"Quick Connect 25' High Pressure Solution Hose",1073346,269.5,null,0]
[null,null,"25' Vacuum Hose (recovery)",610683,274.70000000000005,null,0]
[null,null,"Standard Metering Tip Packet (3 tips included)",609757,15.2,null,0]
[null,null,"14\" (356mm) Floor Squeegee Tool",609648,64.199999999999989,null,0]
[null,null,"Gulper Tool",609645,20.8,null,0]
[null,null,"Blower Nozzle",609644,16.600000000000001,null,0]
[null,null,"Hand Squeegee Tool",609641,153.6,null,0]
[null,null,"Fill Hose",609983,38.300000000000004,null,0]
[null,null,"13\" (330mm) x 1.5\" (38mm), 3 Jet Carpet Tool",600049,1039,null,{"$f":"F72*E72","v":0}]
[]
[null,null,null,null,null,{"$f":"SUM(F75)","v":0}]
[null,null,"Blower - Three-speed Air Mover",614277,372,null,{"$f":"F75*E75","v":0}]
[null,null,"1/2 Horsepower, Three speeds, Stackable, Rotomolded durability.",null,null,{"$f":"SUM(F75)","v":0}]
[null,null,"ETL-certified to UL & CSA Standards.",null,null,{"$f":"SUM(F76)","v":0}]
[null,null,"Boxed dimensions:  20.5L x 17.75W x 22.5H (521mm x 451mmx 572mm)  *",null,null,{"$f":"SUM(F77)","v":0}]
[null,null,"Shipping Weight: 37.3 lbs.",null,null,{"$f":"SUM(F78)","v":0}]
[]
[]
[null,"Custom Solution--write in description, qty, price, and PN if applicable",null,null,null,{"$f":"SUM(F83)","v":0}]
[null,null,null,null,"Insert Prices Here",{"$f":"SUM(F84:F87)","v":0}]
[null,null,null,"Custom",null,{"$f":"IF(E84 <> \"\", 1, 0)","v":0},{"$f":"F84*E84","v":0}]
[null,null,null,"Custom",null,{"$f":"IF(E85 <> \"\", 1, 0)","v":0},{"$f":"F85*E85","v":0}]
[null,null,null,"Custom",null,{"$f":"IF(E86 <> \"\", 1, 0)","v":0},{"$f":"F86*E86","v":0}]
[null,null,null,"Custom",null,{"$f":"IF(E87 <> \"\", 1, 0)","v":0},{"$f":"F87*E87","v":0}]
[null,null,"Prepaid and Add","Freight",null,1,{"$f":"F88*E88","v":0}]
[null,null,"Subject to all applicable taxes","Tax",null,1,{"$f":"F89*E89","v":0}]
[]
[null,null,null,"MACHINE TOTAL*",null,null,{"$f":"SUM(G33:G89)","v":0},null,null,null,null,null,null,"This goes to \"My Documents\""]
[null,null,null,null,null,null,{"$f":"SUM(G91)","v":0}]
[]
[null,null,"National Leasing - Leasing Calculation Option:","Finance Option 1",null,"Finance Option 2",null,null,{"$f":"Financing!A38","v":"Rates 2016 - Rev. 7/1/2016"}]
[null,null,"Purchase Option:",1,null,"FMV Scrubber",null,null,{"$f":"Financing!A39","v":"“Blank Payment Amounts Indicate The Financing Option Or Purchase Options Selected Are Not "}]
[null,null,"24 Months",0,null,0,null,null,{"$f":"Financing!A40","v":"Applicable Or The Machine Total Is Below The Minimum Amount For The Selected Vendor”"}]
[null,null,"36 Months",0,null,0,null,null,{"$f":"Financing!A41","v":"\"Quoted monthly payments are estimates only and are based on a certain level of credit rating."}]
[null,null,"48 Months",0,null,0,null,null,{"$f":"Financing!A42","v":"Actual monthly payments may be higher depending on your credit rating.\""}]
[null,null,"60 Months",0,null,0,null,null,{"$f":"Financing!A43","v":"“Financing rates do not include Pre-Paid Service”"}]
[null,"   TennantTrue",null,null,0,0]
[]
[null,null,"Is customer interested in service program?","Yes","*State/County selection required for TennantTrue service options"]
[]
[null,null,"If not, why?"]
[]
[null,null,"Term:",36,null,null,"AB Brushes","No"]
[null,null,"Monthly machine usage (hrs):",25]
[]
[null,null,"TennantTrue: ","Rate Per Unit",null,"Hourly Labor Rate",null,"Site Visit Charge"]
[null,null,"Gold - Monthly"]
[null,null,"Gold - Pre Pay Full Term"]
[null,null,"Silver - Monthly"]
[null,null,"Silver - Annually"]
[null,null,"Silver - Pre Pay Full Term"]
[null,null,"Silver - Per Visit"]
[null,null,"Pay As You Go",null,null,null,null,null,null,null,"*State/County selection required for 'Pay As You Go' and 'On Demand'."]
[null,null,"On Demand"]
[]
[]
[]
[null,null,"Quote Special Instructions:"]
[]
[]
[null,null,{"$f":"Start_Here!E33","v":"Terms and Conditions"}]
[null,null,{"$f":"Start_Here!E34","v":"Ask your local sales rep for estimated lead times. Verify when placing order"}]
[null,null,{"$f":"Start_Here!E35","v":"All orders subject to acceptance by Tennant Sales and Service Company, Minneapolis, Minnesota"}]
[null,null,{"$f":"Start_Here!E36","v":"Prices subject to change without notice. Subject to any applicable taxes."}]
[null,null,{"$f":"Start_Here!E37","v":"Terms:  Net 30 days.  Payable in Canadian Funds"}]
[null,null,{"$f":"Start_Here!E38","v":"Freight:  Accessories, parts, supplies, detergents, and floor coatings orders delivered DDP "}]
[null,null,{"$f":"Start_Here!E39","v":"shipping point Frt PPD.  Machine orders delivered DDP shipping point Frt PPD and add."}]
[null,null,{"$f":"Start_Here!E40","v":"Returned Merchandise is subject to a restocking fee."}]
[null,null,{"$f":"Start_Here!E42","v":"Printed General Terms and Conditions are also available upon request."}]
[null,null,{"$f":"Start_Here!E43","v":0}]
[]
[]
[null,null,null,null,"Quote Date :",null,{"$f":"Letter!$A$25","v":"2014-10-02"}]
["Order Placement Information:  To place your order, fill in PO# and customer signatures,"]
["call or fax to the numbers listed below. Customer Purchase Order is required."]
["If information is missing, orders will be entered and held until all information is received."]
[null,null,"Customer Number",null,{"$f":"Start_Here!F15","v":"Cust Grp 3"}]
[null,null,{"$f":"Start_Here!$F$5","v":0},null,{"$f":"Start_Here!F16","v":0}]
[null,null,{"$f":"Start_Here!$B$18","v":"Sold To Information (Please Verify)"}]
["Company",null,{"$f":"Start_Here!$C$19","v":""}]
["Address",null,{"$f":"Start_Here!$C$20","v":""}]
[null,null,{"$f":"Start_Here!$C$21","v":""}]
["Name",null,{"$f":"Start_Here!$C$22","v":""}]
["Phone",null,{"$f":"Start_Here!$C$23","v":""}]
[null,null,{"$f":"Start_Here!$B$11","v":"Ship To Information (Please Verify)"}]
["Company",null,{"$f":"Start_Here!$C$12","v":""}]
["Address",null,{"$f":"Start_Here!$C$13","v":""}]
[null,null,{"$f":"Start_Here!$C$14","v":""}]
["Name",null,{"$f":"Start_Here!$C$15","v":""}]
["Phone",null,{"$f":"Start_Here!$C$16","v":""}]
[null,null,{"$f":"Start_Here!$B$25","v":"Shipping/Carrier Instructions:"},null,"Order Special Instructions:"]
[null,null,{"$f":"Start_Here!$C$26","v":0}]
[]
[null,null," Customer Purchase Order No. "]
[null,null," (please attach copy) "]
[]
[]
[null,null," Tax Exempt ",null," Yes "]
[null,null,null,null," No "]
[null,null," If Yes, attach a copy of your exemption certificate. "]
[]
[null,null," Requested Delivery Date "]
[null,null,{"$f":"Start_Here!$F$14","v":0}]
[]
[null,null,{"$f":"Start_Here!$F$8","v":0},null,{"$f":"Start_Here!$F$11","v":0}]
[null,null," Authorized Buyer (please print) ",null," Phone Number "]
[]
[null,null," Authorized Buyer Signature "]
[]
[null,null,"Tennant Representative"]
[]
["Specialized Maintenance Equipment"]
[{"$f":"Start_Here!$C$45","v":"TENNANT · 701 NORTH LILAC DRIVE · P.O. BOX 1452 · MINNEAPOLIS, MN 55440-1452 ·"}]
[{"$f":"Start_Here!$C$46","v":" PHONE:800-553-8033 · FAX:763-513-2116"}]
[]
[null,"Special Information "]
[]
[]
[null,"1","Pre-Configured Machines cannot add or change options.  All units are packaged on a Skid w/Carton and will ship via LTL Carrier."]
[null,null,"When ordering, provide the reference number listed above.  Price does not include freight or tax.  Availability of units "]
[null,null,"and lead time may vary."]
[]
[null,"2","One pad driver comes standard with a T2."]
[]
[null,3,"Skid w/Carton, Stackable is the default packaging method and will be added to the configuration unless otherwise specified."]
[]
[null,4,"Machine Weights and dimensions","Skid w/Carton"]
[]
[null,null,"Weight (w/105AH battery)","331 lbs / 150 Kg"]
[null,null,"Length","47\" / 1200mm"]
[null,null,"Width","30\" / 750mm"]
[null,null,"Height","45\" / 1150mm"]

{"sheet":"5700","index":4,"n_rows":529,"n_cols":13,"rows_kept":529,"cut":false,"hidden":false,"merged":[[383,5,383,6],[383,7,383,8],[0,2,0,3],[1,2,1,3],[2,2,2,3],[3,2,3,3],[371,3,371,4],[11,1,11,5],[31,1,31,5],[32,1,32,5],[33,1,33,5],[371,5,371,6],[368,3,368,4],[369,3,369,4],[370,3,370,4],[368,5,368,6],[370,5,370,6],[369,5,369,6],[396,2,396,6],[376,4,376,8],[421,2,421,5],[380,3,380,4],[419,2,419,5],[381,3,381,4],[378,3,378,6],[418,2,418,5],[417,2,417,5],[385,3,385,4],[385,5,385,6],[388,3,388,4],[388,5,388,6],[388,7,388,8],[386,5,386,6],[415,4,415,6],[512,2,512,4],[512,6,512,8],[420,2,420,5],[426,2,426,5],[427,2,427,5],[423,2,423,5],[433,2,433,4],[442,4,442,5],[429,4,429,6],[424,2,424,5],[425,2,425,5],[391,3,391,4],[391,5,391,6],[391,7,391,8],[389,3,389,4],[389,5,389,6],[389,7,389,8],[390,3,390,4],[390,5,390,6],[390,7,390,8],[387,3,387,4],[387,5,387,6],[387,7,387,8],[385,7,385,8],[386,3,386,4],[372,5,372,6],[384,5,384,6],[384,7,384,8],[386,7,386,8],[384,3,384,4],[373,3,373,4],[372,3,372,4],[373,5,373,6],[383,3,383,4]]}
[5700,null,{"$f":"Start_Here!$C$8","v":"Contact Name"}]
[null,null,{"$f":"Start_Here!$C$5","v":"Company Name"}]
[null,null,{"$f":"Start_Here!$C$6","v":"Address"}]
[null,null,{"$f":"Start_Here!$C$7","v":"City, State Zip"}]
[null,null,{"$f":"Start_Here!$C$39","v":"Rep Name"}]
[null,null,{"$f":"Start_Here!$C$35","v":"Tennant Sales and Service Company"}]
[null,null,{"$f":"Start_Here!$C$36","v":"701 North Lilac Drive"}]
[null,null,{"$f":"Start_Here!$C$38","v":"Minneapolis, MN 55440-1452"}]
[null,null,{"$f":"Start_Here!$C$41","v":"800-553-8033"},null,"Quote Date :",null,{"$f":"Letter!$A$25","v":"2014-10-02"}]
[]
[]
[null,"BUILT-IN \"TENNANT VALUE\" INCLUDES:"]
[]
[null,"Quick-TrainTM Operator Controls",null,"5700XP Includes:"]
[null,"Linatex Squeegee Blades",null,"Speed Control"]
[null,"Wet 240AH C/20 Batteries (6)",null,"Auto Brush pressure"]
[null,"20A 120V AC 60Hz 1Ph Smart Charger",null,"Auto-squeegee Lift"]
[null,"Low Profile Scrubhead and Squeegee Assembly",null,"One-Button Scrubbing"]
[null,"Two Position Down Pressure",null,"On-Board Service Diagnostics"]
[null,"Adjustable Operator Console",null,"BDI w/Auto Shut-Down"]
[null,"Black Pneumatic Rubber Tires"]
[null,"Solution On/Off w/ Brushes",null,"FaST® Equipped Models Include:"]
[null,"Auto On/Off w/ Propel",null," (Available on 700 & 800mm/28 & 32-inch models only)"]
[null,"Key Switch",null,"Foam Scrubbing Technology System"]
[null,"Hour Meter",null,"Two Scrubbing Modes: FaST® & Conventional Scrubbing"]
[null,"Battery Discharge Indicator",null,"On-Board  FaST-PAK® 2L Detergent Cartridge (Select One)"]
[null,"Std Scrubbing Brushes or Pad Drivers(Select One)"]
[null,null,null,"ec-H2O NanoCleanTM Equipped Models Include:"]
[null,null,null,"Electrically Converted Water Technology System"]
[null,null,null,"Two Scrubbing Modes: ec-H2O NanoCleanTM & Conventional Scrubbing"]
[]
[null,"TENNANT COMPANY WARRANTY"]
[null,"3 YEARS OR 2500 HOURS ON ALL COMPONENTS, 3 YEARS LABOR"]
[null,"90 DAYS TRAVEL, 10 YEARS ON DURAMERTM TANKS"]
[]
[null,null,null,null,"                Quote Request Information"]
[null,null,null,null,null,null,"Fax (quote only)"]
[null,null,null,null,null,null,"Mail (quote,lit, specs)"]
[null,null,null,null,null,null,"Fax + Mail"]
[]
[null,null,null,null,"                Primary Use"]
[null,null,null,null,null,null,"Inside"]
[null,null,null,null,null,null,"Outside"]
[]
[null,null,"Description","Reference #","Canada Price","Qty.","Extended Price"]
[null,"Base Configuration",null,null,null,{"$f":"SUM(F47,F55,F59,F64,F68,F78)","v":0}]
[null,null,"Cleaning Type",null,null,{"$f":"SUM(F48:F53)","v":0},null,null,null,null,null,{"$f":"SUM(F47)","v":0},"Surcharge Qty"]
[null,null,"5700 Walk-Behind Scrubber 700 mm/28\" - Disk","5700-700-D",20823,null,{"$f":"F48*E48","v":0}]
[null,null,"5700 Walk-Behind Scrubber 800 mm/32\" - Disk","5700-800-D",21604,null,0,null,null,null,null,{"$f":"SUM(F49)","v":0},"Surcharge Qty"]
[null,null,"5700 Walk-Behind Scrubber 900 mm/36\" - Disk","5700-900-D",24590,null,0]
[null,null,"5700 Walk-Behind Scrubber 700 mm/28\" - Cylindrical","5700-700-C",22382,null,0,null,null,null,null,0,"Surcharge Qty"]
[null,null,"5700 Walk-Behind Scrubber 800 mm/32\" - Cylindrical","5700-800-C",23163,null,0,null,null,null,null,0,"Surcharge Qty"]
[null,null,"5700 Walk-Behind Scrubber 900 mm/36\" - Cylindrical","5700-900-C",26180,null,0]
[null,null,null,null,null,null,null,null,null,null,null,0,"Surcharge Qty"]
[null,null,"Trim Level (EE and XP are upgrades to the Standard Base Unit)",null,null,{"$f":"SUM(F56:F57)","v":0},null,null,null,null,null,0,"Surcharge Qty"]
[null,null,"EE (Note 1)","EE-5700",6023,null,{"$f":"F56*E56","v":0},null,null,null,null,0,"Surcharge Qty"]
[null,null,"XP","XP-5700",1405,null,{"$f":"F57*E57","v":0},null,null,null,null,0,"Surcharge Qty"]
[null,null,null,null,null,null,null,null,null,null,null,0,"Surcharge Qty"]
[null,null,"Cleaning Technology: (conventional is standard,  ec-H2O NanoClean or FaST: can also operate in conventional mode)",null,null,{"$f":"SUM(F60:F62)","v":0}]
[null,null,"ec-H2O NanoClean™","ec-H2ONC-5700",2940,null,{"$f":"F60*E60","v":0},null,null,null,null,0,"Surcharge Qty"]
[null,null,"FaST® (Note 2)","FaST-5700",2704,null,{"$f":"F61*E61","v":0},null,null,null,null,0,"Surcharge Qty"]
[null,null,"ES","ES-5700",2060,null,{"$f":"F62*E62","v":0},null,null,null,null,0,"Surcharge Qty"]
[null,null,null,null,null,null,null,null,null,null,null,0,"Surcharge Qty"]
[null,null,"Squeegee Width (Note 3)",null,null,{"$f":"SUM(F65:F66)","v":0},null,null,null,null,null,0,"Surcharge Qty"]
[null,null,"Standard","STD-5700","N/C",null,{"$f":"IF(F65=0,\" \",\"N/C\")","v":" "},null,null,null,null,0,"Surcharge Qty"]
[null,null,"Narrow Aisle","NR-5700","N/C",null,{"$f":"IF(F66=0,\" \",\"N/C\")","v":" "},null,null,null,null,0,"Surcharge Qty"]
[null,null,null,null,null,null,null,null,null,null,null,{"$f":"SUM(F67)","v":0},"Surcharge Qty"]
[null,null,"Battery Type (Note 4)",null,null,{"$f":"SUM(F69:F76)","v":0}]
[null,null,"Wet 240AH C/20  (Kit of 6 batteries)",222359,"N/C",null,{"$f":"IF(F69=0,\" \",\"N/C\")","v":" "},null,null,null,null,{"$f":"SUM(F69)","v":0},"Surcharge Qty"]
[null,null,"Wet 360AH C/20  (Kit of 6 batteries)  (No charge w/ HD Brush Motors or 900D)",222357,714,null,{"$f":"F70*E70","v":0}]
[null,null,"Wet 360AH C/20  (Kit of 6 batteries)  *Purchased w/ HD Brush Motors or 900D*",222357,"N/C",null,{"$f":"IF(F71=0,\" \",\"N/C\")","v":" "}]
[null,null,"Sealed/MF Gel 180AH C/20  (Kit of 6 batteries)",324442,2429,null,{"$f":"F72*E72","v":0},null,null,null,null,{"$f":"SUM(F72)","v":0},"Surcharge Qty"]
[null,null,"Sealed/MF AGM 220AH C/20  (Kit of 6 batteries)",324444,2177,null,{"$f":"F73*E73","v":0}]
[null,null,"Without Battery",null,-1181,null,{"$f":"F74*E74","v":0},null,null,null,null,0,"Surcharge Qty"]
[null,null,null,null,null,{"$f":"SUM(F76)","v":0},null,null,null,null,null,0,"Surcharge Qty"]
[null,null,"HydroLink® Battery Watering Kit  (Note 5)",9009620,698,null,{"$f":"F76*E76","v":0}]
[null,null,null,null,null,null,null,null,null,null,null,0,"Surcharge Qty"]
[null,null,"Charger","Reference Number",null,{"$f":"SUM(F79:F85)","v":0},null,null,null,null,null,0,"Surcharge Qty"]
[null,null,"20A 120V AC 60Hz 1Ph (for 240AH batteries)",374014,"N/C",null,{"$f":"IF(F79=0,\" \",\"N/C\")","v":" "},null,null,null,null,0,"Surcharge Qty"]
[null,null,"21A 85-265V AC 50/60Hz 1 Ph (for 240AH batteries)",9001051,"N/C",null," "]
[null,null,"21A 85-265V AC 50/60Hz 1 Ph (for 360AH batteries)",9004241,"N/C",null," ",null,null,null,null,0,"Surcharge Qty"]
[null,null,"21A 85-265V AC 50/60Hz 1 Ph (for AGM batteries)",9008267,"N/C",null," "]
[null,null,"21A 85-265V AC 50/60Hz 1 Ph (for GEL batteries)",9008266,"N/C",null," ",null,null,null,null,0,"Surcharge Qty"]
[null,null,"36A 120V AC 60Hz 1Ph (for 360AH batteries)",602003,822,null,{"$f":"F84*E84","v":0},null,null,null,null,0,"Surcharge Qty"]
[null,null,"Without  Charger",null,-822,null,{"$f":"F85*E85","v":0},null,null,null,null,0,"Surcharge Qty"]
[null,null,null,null,null,null,null,null,null,null,null,0,"Surcharge Qty"]
[null,"Cleaning Performance",null,"Reference Number",null,{"$f":"SUM(F88:F94)","v":0},null,null,null,null,null,0,"Surcharge Qty"]
[null,null,"Heavy Duty Brush Motors (Note 6)","HD-5700",1561,null,{"$f":"F88*E88","v":0},null,null,null,null,0,"Surcharge Qty"]
[null,null,"Power Wand (w/Prep Kit) (Note 7)",222611,2154,null,{"$f":"F89*E89","v":0},null,null,null,null,0,"Surcharge Qty"]
[null,null,"Vacuum Wand (Note 8)",222608,311,null,{"$f":"F90*E90","v":0}]
[null,null,"Dual Vacuum Fans",222348,745,null,{"$f":"F91*E91","v":0}]
[null,null,"Recovery Tank Debris Tray",1042996,103.8,null,{"$f":"F92*E92","v":0}]
[]
[null,null,"FaST Detergent (Note 9)",null,null,{"$f":"SUM(F95:F97)","v":0}]
[null,null,"FaST®  365 (2L) - Neutral Cleaner",1017015,"N/C",null,{"$f":"IF(F95=0,\" \",\"N/C\")","v":" "}]
[null,null,"FaST®  665 (2L) - Degreaser",1017022,"N/C",null,{"$f":"IF(F96=0,\" \",\"N/C\")","v":" "}]
[null,null,"FaST®  965 (2L) - HD Degreaser",9002021,"N/C",null,{"$f":"IF(F97=0,\" \",\"N/C\")","v":" "}]
[]
[null,"Machine Protection & Safety",null,"Reference Number",null,{"$f":"SUM(F100:F109)","v":0}]
[null,null,"Parking Brake","Base & EE - 222150\nXP - 377399",374,null,{"$f":"F100*E100","v":0}]
[null,null,"Emergency Stop",222461,325,null,0]
[null,null,"Tires, Black Pneumatic Rubber",9002744,"N/C",null,{"$f":"IF(F102=0,\" \",\"N/C\")","v":" "}]
[null,null,"Tires, Black Foam-Filled Rubber",374048,341,null,0]
[null,null,"Tires, Gray Foam-Filled Rubber",374047,359,null,0]
[null,null,"Tires, Black Solid Rubber ",222350,196,null,0]
[null,null,"Tires, Gray Pneumatic Rubber",374024,84,null,0]
[null,null,"Casters, Black Neoprene",222459,275,null,0]
[null,null,"Wall Protection Rollers",222482,807,null,0]
[null,null,"Tralier Transport Kit",222471,252,null,0]
[]
[null,"Brushes and Pads (Note 10)",null,"Reference Number",null,{"$f":"SUM(F112,F125,F140,F153,F159,F165)","v":0}]
[null,null,"700mm/28\" Disk Scrubbing Brushes/Pads (2 Required - 14\" each)",null,null,{"$f":"SUM(F113:F123)","v":0}]
[null,null,"Polypropylene Brush",1220237,"N/C",null,{"$f":"IF(F113=0,\" \",\"N/C\")","v":" "}]
[null,null,"Nylon Brush",1220238,"N/C",null,{"$f":"IF(F114=0,\" \",\"N/C\")","v":" "}]
[null,null,"Super Abrasive Brush ",1220239,317,null,{"$f":"F115*E115","v":0}]
[]
[null,null,"Pad Driver",1220198,"N/C",null,{"$f":"IF(F117=0,\" \",\"N/C\")","v":" "}]
[null,null,"Pads ",null,null,{"$f":"SUM(F119:F123)","v":0}]
[null,null,"  Brown Stripping  - 3M ",222327,16.600000000000001,null,{"$f":"F119*E119","v":0}]
[null,null,"  Blue Scrubbing - 3M   ",222326,16.600000000000001,null,{"$f":"F120*E120","v":0}]
[null,null,"  Red Cleaning - 3M         ",222325,16.600000000000001,null,{"$f":"F121*E121","v":0}]
[null,null,"  White Polishing - 3M         ",222324,16.600000000000001,null,{"$f":"F122*E122","v":0}]
[null,null,"  Black Stripping-Hi Pro - 3M         ",370091,19.600000000000001,null,{"$f":"F123*E123","v":0}]
[]
[null,null,"800mm/32\" Disk Scrubbing Brushes/Pads (2 Required - 16\" each)",null,null,{"$f":"SUM(F126:F138)","v":0}]
[null,null,"Polypropylene Brush",1220241,"N/C",null,{"$f":"IF(F126=0,\" \",\"N/C\")","v":" "}]
[null,null,"Heavy Duty Polypropylene Brush",1220236,"N/C",null,{"$f":"IF(F127=0,\" \",\"N/C\")","v":" "}]
[null,null,"Nylon Brush",1220235,"N/C",null,{"$f":"IF(F128=0,\" \",\"N/C\")","v":" "}]
[null,null,"Super Abrasive Brush ",1221543,317,null,{"$f":"F129*E129","v":0}]
[null,null,"Crinkle Wire Brush",1220234,317,null,{"$f":"F130*E130","v":0}]
[]
[null,null,"Pad Driver",1220199,"N/C",null,{"$f":"IF(F132=0,\" \",\"N/C\")","v":" "}]
[null,null,"Pads ",null,null,{"$f":"SUM(F134:F138)","v":0}]
[null,null,"  Brown Stripping  - 3M ","63248-1",19.600000000000001,null,{"$f":"F134*E134","v":0}]
[null,null,"  Blue Scrubbing - 3M   ","63248-2",19.600000000000001,null,{"$f":"F135*E135","v":0}]
[null,null,"  Red Cleaning - 3M         ","63248-3",19.600000000000001,null,{"$f":"F136*E136","v":0}]
[null,null,"  White Polishing - 3M         ","63248-4",19.600000000000001,null,{"$f":"F137*E137","v":0}]
[null,null,"  Black Stripping-Hi Pro - 3M         ",370092,31.8,null,{"$f":"F138*E138","v":0}]
[]
[null,null,"900mm/36\" Disk Scrubbing Brushes/Pads (2 Required - 18\" each)",null,null,{"$f":"SUM(F141:F151)","v":0}]
[null,null,"Polypropylene Brush",1220188,"N/C",null,{"$f":"IF(F141=0,\" \",\"N/C\")","v":" "}]
[null,null,"Nylon Brush",1220191,"N/C",null,{"$f":"IF(F142=0,\" \",\"N/C\")","v":" "}]
[null,null,"Super Abrasive Brush ",1220190,381,null,{"$f":"F143*E143","v":0}]
[]
[null,null,"Pad Driver",1220200,"N/C",null,{"$f":"IF(F145=0,\" \",\"N/C\")","v":" "}]
[null,null,"Pads ",null,null,{"$f":"SUM(F147:F151)","v":0}]
[null,null,"  Brown Stripping  - 3M ",11777,22.4,null,{"$f":"F147*E147","v":0}]
[null,null,"  Blue Scrubbing - 3M   ",11778,22.4,null,{"$f":"F148*E148","v":0}]
[null,null,"  Red Cleaning - 3M         ",11780,22.4,null,{"$f":"F149*E149","v":0}]
[null,null,"  White Polishing - 3M         ",11781,22.4,null,{"$f":"F150*E150","v":0}]
[null,null,"  Black Stripping-Hi Pro - 3M         ",370093,24,null,{"$f":"F151*E151","v":0}]
[]
[null,null,"700mm/28\" Cylindrical Scrubbing Brushes  (2 Required)",null,null,{"$f":"SUM(F154:F157)","v":0}]
[null,null,"Polypropylene Brush",222304,"N/C",null,{"$f":"IF(F154=0,\" \",\"N/C\")","v":" "}]
[null,null,"Heavy Duty Polypropylene Brush",374041,"N/C",null,{"$f":"IF(F155=0,\" \",\"N/C\")","v":" "}]
[null,null,"Nylon Brush",222305,"N/C",null,{"$f":"IF(F156=0,\" \",\"N/C\")","v":" "}]
[null,null,"Abrasive Brush",222306,317,null,{"$f":"F157*E157","v":0}]
[]
[null,null,"800mm/32\" Cylindrical Scrubbing Brushes  (2 Required)",null,null,{"$f":"SUM(F160:F163)","v":0}]
[null,null,"Polypropylene Brush",222307,"N/C",null,{"$f":"IF(F160=0,\" \",\"N/C\")","v":" "}]
[null,null,"Heavy Duty Polypropylene Brush",374042,"N/C",null,{"$f":"IF(F161=0,\" \",\"N/C\")","v":" "}]
[null,null,"Nylon Brush",222308,"N/C",null,{"$f":"IF(F162=0,\" \",\"N/C\")","v":" "}]
[null,null,"Abrasive Brush",222309,317,null,{"$f":"F163*E163","v":0}]
[]
[null,null,"900mm/36\" Cylindrical Scrubbing Brushes  (2 Required)",null,null,{"$f":"SUM(F166:F169)","v":0}]
[null,null,"Polypropylene Brush",222310,"N/C",null,{"$f":"IF(F166=0,\" \",\"N/C\")","v":" "}]
[null,null,"Heavy Duty Polypropylene Brush",374043,"N/C",null,{"$f":"IF(F167=0,\" \",\"N/C\")","v":" "}]
[null,null,"Nylon Brush",222311,"N/C",null,{"$f":"IF(F168=0,\" \",\"N/C\")","v":" "}]
[null,null,"Abrasive Brush",222312,381,null,{"$f":"F169*E169","v":0}]
[]
[null,"Support",null,"Reference Number",null,{"$f":"SUM(F172:F190)","v":0}]
[null,null,"5700 Operator Manual (English)",331530,"N/C",null,{"$f":"IF(F172=0,\" \",\"N/C\")","v":" "}]
[null,null,"5700 Operator Manual - EE (English)",331535,"N/C",null," "]
[null,null,"5700 Operator Manual - XP (English)",331533,"N/C",null," "]
[null,null,"5700 Operator Manual (Spanish)",331542,"N/C",null," "]
[null,null,"5700 Operator Manual - EE (Spanish)",331546,"N/C",null," "]
[null,null,"5700 Operator Manual - XP (Spanish)",331544,"N/C",null," "]
[null,null,"5700 Operator Manual (French)  (Note 11)",331543,"N/C",null," "]
[null,null,"5700 Operator Manual - EE (French)",331547,"N/C",null," "]
[null,null,"5700 Operator Manual - XP (French)",331545,"N/C",null," "]
[null,null,"Additional Operator Manual","See above",53.2,null,{"$f":"F181*E181","v":0}]
[null,null,"5700 Parts Manual",331532,14,null,0]
[null,null,"5700 Parts Manual - EE",331536,14,null,0]
[null,null,"5700 Parts Manual - XP",331534,14,null,0]
[null,null,"Additional Parts Manual","See above",55,null,0]
[null,null,"5700 Operator Video (CD)",1041823,"N/C",null," "]
[null,null,"Additional Operator Video","See above",42,null,0]
[null,null,"Service Manual","MM406",182,null,{"$f":"F188*E188","v":0}]
[]
[null,null,"Packaging",null,null,{"$f":"SUM(F191:F191)","v":0}]
[null,null,"Skid w/Carton, Stackable",374071,"N/C",null,{"$f":"IF(F191=0,\" \",\"N/C\")","v":" "}]
[]
[null,"AFTERMARKET ITEMS (ordered separately) :",null,null,null,{"$f":"SUM(F195)","v":0}]
[]
[null,"Brushes, Pad Drivers and Pads (Replacements)",null,"Reference Number",null,{"$f":"SUM(F196,F210,F227,F241,F247,F253)","v":0}]
[null,null,"700mm/28\" Disk Scrubbing Brushes/Pads (2 Required - 14\" each)",null,null,{"$f":"SUM(F197:F208)","v":0}]
[null,null,"Polypropylene Brush",1220237,219.29999999999998,null,{"$f":"F197*E197","v":0}]
[null,null,"Nylon Brush",1220238,319.10000000000002,null,{"$f":"F198*E198","v":0}]
[null,null,"Super Abrasive Brush ",1220239,459,null,{"$f":"F199*E199","v":0}]
[null,null,null,null,null,{"$f":"SUM(F201)","v":0}]
[null,null,"Pad Driver",1220198,349.90000000000003,null,{"$f":"F201*E201","v":0}]
[null,null,"Pads ",null,null,{"$f":"SUM(F203:F208)","v":0}]
[null,null,"  Brown Stripping  - 3M ",222327,16.600000000000001,null,{"$f":"F203*E203","v":0}]
[null,null,"  Blue Scrubbing - 3M   ",222326,16.600000000000001,null,0]
[null,null,"  Red Cleaning - 3M         ",222325,16.600000000000001,null,0]
[null,null,"  White Polishing - 3M         ",222324,16.600000000000001,null,0]
[null,null,"  Black Stripping-Hi Pro - 3M         ",370091,19.600000000000001,null,0]
[null,null,"  Maroon Surface Prep Pad - 3M         ",1051026,18.700000000000003,null,0]
[]
[null,null,"800mm/32\" Disk Scrubbing Brushes/Pads (2 Required - 16\" each)",null,null,{"$f":"SUM(F211:F225)","v":0}]
[null,null,"Polypropylene Brush",1220241,261.8,null,{"$f":"F211*E211","v":0}]
[null,null,"Heavy Duty Polypropylene Brush",1220236,284.89999999999998,null,0]
[null,null,"Nylon Brush",1220235,352,null,0]
[null,null,"Super Abrasive Brush ",1221543,475.5,null,0]
[null,null,"Bassine Brush",1220233,344.4,null,0]
[null,null,"Crinkle Wire Brush",1220234,612.70000000000005,null,0]
[null,null,null,null,null,{"$f":"SUM(F218)","v":0}]
[null,null,"Pad Driver",1220199,393.90000000000003,null,{"$f":"F218*E218","v":0}]
[null,null,"Pads ",null,null,{"$f":"SUM(F220:F225)","v":0}]
[null,null,"  Brown Stripping  - 3M ","63248-1",19.600000000000001,null,{"$f":"F220*E220","v":0}]
[null,null,"  Blue Scrubbing - 3M   ","63248-2",19.600000000000001,null,0]
[null,null,"  Red Cleaning - 3M         ","63248-3",19.600000000000001,null,0]
[null,null,"  White Polishing - 3M         ","63248-4",19.600000000000001,null,0]
[null,null,"  Black Stripping-Hi Pro - 3M         ",370092,31.8,null,0]
[null,null,"  Maroon Surface Prep Pad - 3M         ",1051027,23.8,null,0]
[]
[null,null,"900mm/36\" Disk Scrubbing Brushes/Pads (2 Required - 18\" each)",null,null,{"$f":"SUM(F228:F239)","v":0}]
[null,null,"Polypropylene Brush",1220188,315.5,null,{"$f":"F228*E228","v":0}]
[null,null,"Nylon Brush",1220191,403.5,null,{"$f":"F229*E229","v":0}]
[null,null,"Super Abrasive Brush ",1220190,628.1,null,{"$f":"F230*E230","v":0}]
[null,null,null,null,null,{"$f":"SUM(F232)","v":0}]
[null,null,"Pad Driver",1220200,393.90000000000003,null,{"$f":"F232*E232","v":0}]
[null,null,"Pads ",null,null,{"$f":"SUM(F234:F239)","v":0}]
[null,null,"  Brown Stripping  - 3M ",11777,22.4,null,{"$f":"F234*E234","v":0}]
[null,null,"  Blue Scrubbing - 3M   ",11778,22.4,null,0]
[null,null,"  Red Cleaning - 3M         ",11780,22.4,null,0]
[null,null,"  White Polishing - 3M         ",11781,22.4,null,0]
[null,null,"  Black Stripping-Hi Pro - 3M         ",370093,24,null,0]
[null,null,"  Maroon Surface Prep Pad - 3M         ",1051029,28.3,null,0]
[]
[null,null,"700mm/28\" Cylindrical Scrubbing Brushes  (2 Required)",null,null,{"$f":"SUM(F242:F245)","v":0}]
[null,null,"Polypropylene",222304,190.9,null,{"$f":"F242*E242","v":0}]
[null,null,"Heavy Duty Polypropylene",374041,191.29999999999998,null,{"$f":"F243*E243","v":0}]
[null,null,"Nylon",222305,280,null,{"$f":"F244*E244","v":0}]
[null,null,"Abrasive",222306,403,null,{"$f":"F245*E245","v":0}]
[]
[null,null,"800mm/32\" Cylindrical Scrubbing Brushes  (2 Required)",null,null,{"$f":"SUM(F248:F251)","v":0}]
[null,null,"Polypropylene",222307,215.2,null,{"$f":"F248*E248","v":0}]
[null,null,"Heavy Duty Polypropylene",374042,213.5,null,{"$f":"F249*E249","v":0}]
[null,null,"Nylon",222308,312.70000000000005,null,{"$f":"F250*E250","v":0}]
[null,null,"Abrasive",222309,464.8,null,{"$f":"F251*E251","v":0}]
[]
[null,null,"900mm/36\" Cylindrical Scrubbing Brushes  (2 Required)",null,null,{"$f":"SUM(F254:F257)","v":0}]
[null,null,"Polypropylene Brush",222310,257.90000000000003,null,{"$f":"F254*E254","v":0}]
[null,null,"Heavy Duty Polypropylene Brush",374043,256.40000000000003,null,{"$f":"F255*E255","v":0}]
[null,null,"Nylon Brush",222311,346.70000000000005,null,{"$f":"F256*E256","v":0}]
[null,null,"Abrasive Brush",222312,617.20000000000005,null,{"$f":"F257*E257","v":0}]
[]
[null,"Aftermarket FaST-PAK ® Detergent ",null,null,null,{"$f":"SUM(F260:F262)","v":0}]
[null,null,"FaST®  365 (2L) - Neutral Cleaner",1017015,189.7,null,{"$f":"F260*E260","v":0}]
[null,null,"FaST®  665 (2L) - Degreaser",1017022,346,null,{"$f":"F261*E261","v":0}]
[null,null,"FaST®  965 (2L) - HD Degreaser",9002021,447.6,null,{"$f":"F262*E262","v":0}]
[]
[null,"Aftermarket Maintenance Items  (Ordered separately)",null,"Reference Number","2016 Price",{"$f":"SUM(F265,F272,F278)","v":0}]
[null,null,"Disk & Cylindrical Brush Versions",null,null,{"$f":"SUM(F266,F272,F278,F284)","v":0}]
[null,null,"700mm/28\" ",null,null,{"$f":"SUM(F267:F270)","v":0}]
[null,null,"Front - Standard Linard Squeegee Blade -700mm/ 28\" with Air-Control Slots",222381,28,null,{"$f":"F267*E267","v":0}]
[null,null,"Rear - Standard Linatex Squeegee Blade - 700/28\" ",222382,35.5,null,{"$f":"F268*E268","v":0}]
[null,null,"Rear Urethane Squeegee Blade",222389,76.2,null,{"$f":"F269*E269","v":0}]
[null,null,"Front Urethane Squeegee Blade",222391,53,null,{"$f":"F270*E270","v":0}]
[]
[null,null,"800mm/32\" ",null,null,{"$f":"SUM(F273:F276)","v":0}]
[null,null,"Front - Standard Linard Squeegee Blade - 800mm/32\" with Air-Control Slots",222241,32.200000000000003,null,{"$f":"F273*E273","v":0}]
[null,null,"Rear - Standard Linatex Squeegee Blade - 800mm/32\" ",222242,46.800000000000004,null,{"$f":"F274*E274","v":0}]
[null,null,"Rear Urethane Squeegee Blade",222388,94.4,null,{"$f":"F275*E275","v":0}]
[null,null,"Front Urethane Squeegee Blade",222392,67.5,null,{"$f":"F276*E276","v":0}]
[]
[null,null,"900mm/36\"",null,null,{"$f":"SUM(F279:F283)","v":0}]
[null,null,"Front-Grouted, Linard Squeegee Blade with Tile Air-Control Slots - 900mm/36\" with Air-Control Slots",222413,38.700000000000003,null,{"$f":"F279*E279","v":0}]
[null,null,"Front-Standard Linard Squeegee Blade - 900mm/36\"",222414,31.700000000000003,null,{"$f":"F280*E280","v":0}]
[null,null,"Rear - Standard Linatex Squeegee Blade - 900mm/36\" ",222415,54.800000000000004,null,{"$f":"F281*E281","v":0}]
[null,null,"Front Urethane Squeegee Blade",222434,74.7,null,{"$f":"F282*E282","v":0}]
[null,null,"Rear Urethane Squeegee Blade",222435,104.5,null,{"$f":"F283*E283","v":0}]
[null,null,null,null,null,{"$f":"SUM(F285:F287)","v":0}]
[null,null,"Cylindrical Scrub Head Skirt Kit",222711,103.89999999999999,null,{"$f":"F285*E285","v":0}]
[null,null,"Recovery Tank Debris Screen",1042996,103.8,null,{"$f":"F286*E286","v":0}]
[null,null,"HydroLink® Battery Watering Kit (for 240 AH and 360 AH batteries), for 36V system",9010301,323,null,{"$f":"F287*E287","v":0}]
[]
[null,"Detergents   See NOTE 15 for Detergent Replacement Information Table ",null,null,null,{"$f":"SUM(F290:F307)","v":0}]
[null,null,"General Purpose Cleaner 2 -2.5 Gal.",9006764,91.2,null,{"$f":"F290*E290","v":0}]
[null,null,"General Purpose Cleaner 15 Gal w/Pump",9006765,265.5,null,0]
[null,null,"General Purpose Cleaner 55 Gal w/Pump",9006767,834.4,null,0]
[null,null,"General Purpose Cleaner 275 Gal Tote",9006769,3185.9,null,0]
[null,null,"High Alkaline Degreaser 2 -2.5 Gal.",9006776,121.4,null,0]
[null,null,"High Alkaline Degreaser 15 Gal w/Pump",9006777,333.9,null,0]
[null,null,"High Alkaline Degreaser 55 Gal w/Pump",9006779,1092.5,null,0]
[null,null,"High Alkaline Degreaser 275 Gal Tote",9006781,4096,null,0]
[null,null,"Solvent Based Degreaser,  2 - 2.5 Gal.",9006770,182.2,null,0]
[null,null,"Solvent Based Degreaser, 55 Gallon",9006773,1668.8,null,0]
[null,null,"Solvent Based Degreaser,  2 - 2.5 Gal. (yellow)",9006770,182.2,null,0]
[null,null,"Solvent Based Degreaser, 15 Gal. w/pump (yellow)",9006771,500.7,null,0]
[null,null,"Solvent Based Degreaser, 55 Gallon (yellow)",9006773,1668.8,null,0]
[null,null,"Solvent Based Degreaser, 275 Gal tote (yellow)",9006775,6371.6,null,0]
[null,null,"Super Strength Degreaser,  2 - 2.5 Gal. (orange)",9008791,279.3,null,0]
[null,null,"Super Strength Degreaser, 15 Gallon w/pump (orange)",9008792,837.9,null,0]
[null,null,"Super Strength Degreaser, 55 Gallon w/pump (orange)",9008794,2013.9,null,0]
[null,null,"Super Strength Degreaser 275 Gal Tote (orange)",9008798,8591.1,null,0]
[null,"Granular Detergents",null,null,null,{"$f":"SUM(F309:F310)","v":0}]
[null,null,"High Alkaline Granular Degreaser, 22 lb (10 bags-2.2 lbs per bag) ",9006782,74.400000000000006,null,0]
[null,null,"High Alkaline Granular Degreaser, 250 lb. drum.",9006783,743.3,null,0]
[]
[null,"Aftermarket - FINISHED CONCRETE SYSTEMS      No Additional Discounts Allowed",null,null,null,{"$f":"SUM(F313:F343,F353)","v":0}]
[null,null,null,null,null,{"$f":"SUM(F314:F343)","v":0}]
[null,null,"14 in - 25/35 grit CCW Concrete Tool (Counter-clockwise)",1059815,788.2,null,{"$f":"F314*E314","v":0}]
[null,null,"14 in - 25/35 grit CW Concrete Tool (Clockwise)",1059819,788.2,null,0]
[null,null,"16 in - 25/35 grit CCW Concrete Tool (Counter-clockwise)",1059824,803.1,null,0]
[null,null,"16 in - 25/35 grit CW Concrete Tool (Clockwise)",1059822,803.1,null,0]
[null,null,"18 in - 25/35 grit CCW Concrete Tool (Counter-clockwise)",1059826,841,null,0]
[null,null,"18 in - 25/35 grit CW Concrete Tool (Clockwise)",1059858,841,null,0]
[null,null,"14 in - 100 grit CCW Concrete Tool (Counter-clockwise)",1059812,788.2,null,0]
[null,null,"14 in - 100 grit CW Concrete Tool (Clockwise)",1059809,788.2,null,0]
[null,null,"16 in - 100 grit CCW Concrete Tool (Counter-clockwise)",1056956,803.1,null,0]
[null,null,"16 in - 100 grit CW Concrete Tool (Clockwise)",1056957,803.1,null,0]
[null,null,"18 in - 100 grit CCW Concrete Tool (Counter-clockwise)",1057117,841,null,0]
[null,null,"18 in - 100 grit CW Concrete Tool (Clockwise)",1057120,841,null,0]
[null,null,"14 in - 50 Grit Polymer Tool (Brown Blade)",1059717,851.2,null,0]
[null,null,"14 in - 100 Grit Polymer Tool (Black Blade)",1059718,851.2,null,0]
[null,null,"14 in - 200 Grit Polymer Tool (Blue Blade)",1059719,823.5,null,0]
[null,null,"14 in - 400 Grit Polymer Tool (Green Blade)",1059720,823.5,null,0]
[null,null,"14 in - 1000 Grit Polymer Tool (Red Blade)",1059721,1105.0999999999999,null,0]
[null,null,"14 in - 2000 Grit Polymer Tool (Tan Blade)",1059747,1141.2,null,0]
[null,null,"16 in - 50 Grit Polymer Tool (Brown Blade)",1059748,867.1,null,0]
[null,null,"16 in - 100 Grit Polymer Tool (Black Blade)",1059749,839.2,null,0]
[null,null,"16 in - 200 Grit Polymer Tool (Blue Blade)",1059751,839.2,null,0]
[null,null,"16 in - 400 Grit Polymer Tool (Green Blade)",1059752,839.2,null,0]
[null,null,"16 in - 1000 Grit Polymer Tool (Red Blade)",1059753,1122,null,0]
[null,null,"16 in - 2000 Grit Polymer Tool (Tan Blade)",1059754,1158.5,null,0]
[null,null,"18 in - 50 Grit Polymer Tool (Brown Blade)",1059755,911.2,null,0]
[null,null,"18 in - 100 Grit Polymer Tool (Black Blade)",1059756,883.4,null,0]
[null,null,"18 in - 200 Grit Polymer Tool (Blue Blade)",1059757,883.4,null,0]
[null,null,"18 in - 400 Grit Polymer Tool (Green Blade)",1059758,883,null,0]
[null,null,"18 in - 1000 Grit Polymer Tool (Red Blade)",1059759,1169.5999999999999,null,0]
[null,null,"18 in - 2000 Grit Polymer Tool (Tan Blade)",1059760,1207.8,null,0]
[null,null,"Replacement Blades",null,null,{"$f":"SUM(F345:F352)","v":0}]
[null,null,"25/35 Grit Concrete Blades - 16/set",9007162,560,null,{"$f":"F345*E345","v":0}]
[null,null,"100 Grit Concrete Blades - 16/set",9006738,588,null,0]
[null,null," 50 Grit Polymer Blades - 11/set",1060171,184.4,null,0]
[null,null," 100 Grit Polymer Blades - 11/set",1060180,184.4,null,0]
[null,null," 200 Grit Polymer Blades - 11/set",1060181,184.4,null,0]
[null,null," 400 Grit Polymer Blades - 11/set",1060182,184.4,null,0]
[null,null," 1000 Grit Polymer Blades - 11/set",1060183,242.7,null,0]
[null,null," 2000 Grit Polymer Blades - 11/set",1060184,249.1,null,0]
[null,null,"Concrete Finisher - Maintainer ",null,null,{"$f":"SUM(F354:F355)","v":0}]
[null,null,"Concrete Finisher-Maintainer - 15 Gallon",9006838,393,null,{"$f":"F354*E354","v":0}]
[null,null,"Concrete Finisher-Maintainer - 55 Gallon",9006839,1357.8,null,{"$f":"F355*E355","v":0}]
[]
[null,"Custom Solution--write in description, qty, price, and PN if applicable",null,null,null,{"$f":"SUM(F358)","v":0}]
[null,null,null,null,"Insert Prices Here",{"$f":"SUM(F359:F362)","v":0}]
[null,null,null,"Custom",null,{"$f":"IF(E359 <> \"\", 1, 0)","v":0},{"$f":"F359*E359","v":0}]
[null,null,null,"Custom",null,{"$f":"IF(E360 <> \"\", 1, 0)","v":0},{"$f":"F360*E360","v":0}]
[null,null,null,"Custom",null,{"$f":"IF(E361 <> \"\", 1, 0)","v":0},{"$f":"F361*E361","v":0}]
[null,null,null,"Custom",null,{"$f":"IF(E362 <> \"\", 1, 0)","v":0},{"$f":"F362*E362","v":0}]
[null,null,"Prepaid and Add","Freight",null,1,{"$f":"F363*E363","v":0}]
[null,null,"Subject to all applicable taxes","Tax",null,1,{"$f":"F364*E364","v":0}]
[]
[null,null,null,"MACHINE TOTAL*",null,null,{"$f":"SUM(G48:G364)","v":0},null,null,null,"This goes to \"My Documents\""]
[null,null,null,null,null,null,{"$f":"SUM(G366)","v":0}]
[]
[null,null,"National Leasing - Leasing Calculation Option:","Finance Option 1",null,"Finance Option 2",null,null,{"$f":"Financing!A38","v":"Rates 2016 - Rev. 7/1/2016"}]
[null,null,"Purchase Option:",1,null,"FMV Scrubber",null,null,{"$f":"Financing!A39","v":"“Blank Payment Amounts Indicate The Financing Option Or Purchase Options Selected Are Not "}]
[null,null,"24 Months",0,null,0,null,null,{"$f":"Financing!A40","v":"Applicable Or The Machine Total Is Below The Minimum Amount For The Selected Vendor”"}]
[null,null,"36 Months",0,null,0,null,null,{"$f":"Financing!A41","v":"\"Quoted monthly payments are estimates only and are based on a certain level of credit rating."}]
[null,null,"48 Months",0,null,0,null,null,{"$f":"Financing!A42","v":"Actual monthly payments may be higher depending on your credit rating.\""}]
[null,null,"60 Months",0,null,0,null,null,{"$f":"Financing!A43","v":"“Financing rates do not include Pre-Paid Service”"}]
[null,"   TennantTrue",null,null,0,0]
[]
[null,null,"Is customer interested in service program?","Yes","*State/County selection required for TennantTrue service options"]
[]
[null,null,"If not, why?"]
[]
[null,null,"Term:",36,null,null,"AB Brushes","No"]
[null,null,"Monthly machine usage (hrs):",25]
[]
[null,null,"TennantTrue: ","Rate Per Unit",null,"Hourly Labor Rate",null,"Site Visit Charge"]
[null,null,"Gold - Monthly",80]
[null,null,"Gold - Pre Pay Full Term",2678]
[null,null,"Silver - Monthly",60]
[null,null,"Silver - Annually",703]
[null,null,"Silver - Pre Pay Full Term",2063]
[null,null,"Silver - Per Visit",350]
[null,null,"Pay As You Go",null,null,null,null,null,null,null,"*State/County selection required for 'Pay As You Go' and 'On Demand'."]
[null,null,"On Demand"]
[]
[]
[]
[null,null,"Quote Special Instructions:"]
[]
[]
[null,null,{"$f":"Start_Here!E33","v":"Terms and Conditions"}]
[null,null,{"$f":"Start_Here!E34","v":"Ask your local sales rep for estimated lead times. Verify when placing order"}]
[null,null,{"$f":"Start_Here!E35","v":"All orders subject to acceptance by Tennant Sales and Service Company, Minneapolis, Minnesota"}]
[null,null,{"$f":"Start_Here!E36","v":"Prices subject to change without notice. Subject to any applicable taxes."}]
[null,null,{"$f":"Start_Here!E37","v":"Terms:  Net 30 days.  Payable in Canadian Funds"}]
[null,null,{"$f":"Start_Here!E38","v":"Freight:  Accessories, parts, supplies, detergents, and floor coatings orders delivered DDP "}]
[null,null,{"$f":"Start_Here!E39","v":"shipping point Frt PPD.  Machine orders delivered DDP shipping point Frt PPD and add."}]
[null,null,{"$f":"Start_Here!E40","v":"Returned Merchandise is subject to a restocking fee."}]
[null,null,{"$f":"Start_Here!E42","v":"Printed General Terms and Conditions are also available upon request."}]
[null,null,{"$f":"Start_Here!E43","v":0}]
[]
[]
[null,null,null,null,"Quote Date :",null,{"$f":"Letter!$A$25","v":"2014-10-02"}]
["Order Placement Information:  To place your order, fill in PO# and customer signatures,"]
["call or fax to the numbers listed below. Customer Purchase Order is required."]
["If information is missing, orders will be entered and held until all information is received."]
[null,null,"Customer Number",null,{"$f":"Start_Here!F15","v":"Cust Grp 3"}]
[null,null,{"$f":"Start_Here!$F$5","v":0},null,{"$f":"Start_Here!F16","v":0}]
[null,null,{"$f":"Start_Here!$B$18","v":"Sold To Information (Please Verify)"}]
["Company",null,{"$f":"Start_Here!$C$19","v":""}]
["Address",null,{"$f":"Start_Here!$C$20","v":""}]
[null,null,{"$f":"Start_Here!$C$21","v":""}]
["Name",null,{"$f":"Start_Here!$C$22","v":""}]
["Phone",null,{"$f":"Start_Here!$C$23","v":""}]
[null,null,{"$f":"Start_Here!$B$11","v":"Ship To Information (Please Verify)"}]
["Company",null,{"$f":"Start_Here!$C$12","v":""}]
["Address",null,{"$f":"Start_Here!$C$13","v":""}]
[null,null,{"$f":"Start_Here!$C$14","v":""}]
["Name",null,{"$f":"Start_Here!$C$15","v":""}]
["Phone",null,{"$f":"Start_Here!$C$16","v":""}]
[null,null,{"$f":"Start_Here!$B$25","v":"Shipping/Carrier Instructions:"},null,"Order Special Instructions:"]
[null,null,{"$f":"Start_Here!$C$26","v":0}]
[]
[null,null," Customer Purchase Order No. "]
[null,null," (please attach copy) "]
[]
[]
[null,null," Tax Exempt ",null," Yes "]
[null,null,null,null," No "]
[null,null," If Yes, attach a copy of your exemption certificate. "]
[]
[null,null," Requested Delivery Date "]
[null,null,{"$f":"Start_Here!$F$14","v":0}]
[]
[null,null,{"$f":"Start_Here!$F$8","v":0},null,{"$f":"Start_Here!$F$11","v":0}]
[null,null," Authorized Buyer (please print) ",null," Phone Number "]
[]
[null,null," Authorized Buyer Signature "]
[]
[null,null,"Tennant Representative"]
[]
["Specialized Maintenance Equipment"]
[{"$f":"Start_Here!$C$45","v":"TENNANT · 701 NORTH LILAC DRIVE · P.O. BOX 1452 · MINNEAPOLIS, MN 55440-1452 ·"}]
[{"$f":"Start_Here!$C$46","v":" PHONE:800-553-8033 · FAX:763-513-2116"}]
[]
[null,"SPECIAL INFORMATION"]
[]
[null,"Notes"]
[null,1,"EE version for hazardous environment use.  Only available with 800mm / 32\" scrub head"]
[null,null,"FaST, ec-H2O NanoClean, or ES are not available with EE version of machine."]
[]
[null,2,"FaST Cleaning Technology is only available 700mm / 28\" and 800mm / 32\" scrub head models.  FaST is not available on 900mm / 36\" models."]
[]
[null,3,"Standard Squeegee recovers 100% of water in 180º point turns.  If customer has a narrow aisle, the machine can be"]
[null,null,"set-up for a narrow aisle squeegee.  The narrow-aisle squeegee is the squeegee that comes standard with the "]
[null,null,"next size smaller head and will not recover 100% of the solution in 180º point turns."]
[]
[null,null,"Scrub Head Size","Standard Squeegee","Narrow Aisle"]
[null,null,"700 mm / 28\"","700 mm / 28\" - 397751","550 mm / 22\" - 374032"]
[null,null,"800 mm / 32\"","800 mm / 32\" - 397749","700 mm / 28\" - 397751"]
[null,null,"900 mm / 36\"","900 mm / 36\" - 397750","800 mm / 32\" - 397749"]
[]
[null,3,"Standard Squeegee recovers 100% of water in 180º point turns.  If customer has a narrow aisle, the machine can be"]
[null,null,"set-up for a narrow aisle squeegee.  The narrow-aisle squeegee is the squeegee that comes standard with the "]
[null,null,"next size smaller head (i.e. 800mm/32\" Disk gets the 700mm/28\" squeegee) and will not recover 100% of the solution in 180º point turns."]
[]
[null,4,"240AH Battery is standard for 700mm / 28\" and 800mm / 32\" models and mandatory with EE Trim Level."]
[null,null,"360AH Battery is added at No Charge when ordering an 800mm / 32\" Disk scrub head w/ Heavy Duty Brush Motors or "]
[null,null,"a 900mm / 36\" Disk scrub head."]
[]
[null,5,"Only available with Wet Batteries.  Not compatible with Sealed Gel or AGM Batteries"]
[null,null,"The HD Brush Motor is only available as an upgrade to the standard brush motor used on 700-D and 800-D scrub heads.  The 900-D scrub head comes standard with this Brush Motor."]
[]
[null,6,"Heavy Duty Brush Motors only available on 800mm / 32\" Disk Scrub Heads.  This options is not available with EE Trim Level."]
[null,null,"360AH Battery is added at No Charge when ordering Heavy Duty Brush Motors."]
[]
[null,7,"Power Wand is not compatible with ec-H2O NanoClean or FaST cleaning technologies."]
[]
[null,8,"Vacuum Wand cannot be ordered with Power Wand."]
[]
[null,9,"Only available on FaST models.  FaSTTM Floor Cleaning Concentrate FaST-PAKTM Cartridges. Proprietary super concentrated cleaners"]
[null,null,"for use on Tennant machines with FaSTTM Foam Scrubbing Technology Systems. One 2 liter FaST-PAKTM cartridge cleans one "]
[null,null,"million square feet (90,000m2).  Biodegradable. Phosphate free.  Safe for use on hard floors such as finished or  "]
[null,null,"unfinished VCT, Terrazzo,  Finished Wood, Marble, sealed or unsealed Concrete, Urethane or Epoxy coated surfaces. "]
[null,null,"One FaST-PAK comes with the machine - customer may select from either FaST 365, 665 or 965  Detergent."]
[]
[null,10,"One set of brushes or pad drivers come standard with a 5700."]
[]
[null,11,"A French and English manual will be supplied for all units shipping into Quebec, Canada at no charge.  An additional manual"]
[null,null,"can be ordered (for a total of 3 manuals) for an additional charge as stated under 'Additional Operator Manual'."]
[]
[null,12,"Not available on 5700EE. Pre-Paid and Monthly Packages are available for the IRIS Information Service. IRIS Module is required and NOT included in the price of the IRIS Information Service:"]
[null,null,"3 Year Pre-Paid IRIS Information Service                 $350.00"]
[null,null,"5 Year Pre-Paid IRIS Information Service                 $560.00"]
[null,null,"A monthly contract can be set up at $14 per month w/ 12 month minimum commitment."]
[null,null,"IRIS Telemetry Module only covers the price of the hardware. IRIS Telemetry requires an IRIS Telemetry Module and an IRIS Information Service Package."]
[]
[null,13,"Shipping Weights and Dimensions",null,"Skid w/Carton"]
[]
[null,null,"Weight (w/240AH Battery)",null,"1520 lbs / 690 Kg"]
[null,null,"Length",null,"75\" / 1905 mm"]
[null,null,"Width",null,"45\" / 1143 mm"]
[null,null,"Height",null,"52\" / 1321 mm"]
[]
[null,"14","CURRENT DETERGENT PRODUCT",null,null,null,"NEW DETERGENT PRODUCT"]
[null,null,"Original PN ","Description","Size",null,"New PN ","Description","Size"]
[null,null,"9000755  08682-5","653 & 654 ","5 Gallon",null,9006764,"General Purpose Cleaner","2 -2.5G "]
[null,null,"9000824  08682-15","653 & 654","15 Gallon",null,9006765,"General Purpose Cleaner","15 Gallon"]
[null,null,"9000757  08682-55","653 & 654","55 Gallon",null,9006767,"General Purpose Cleaner","55 Gallon"]
[null,null,"9000758  9000404","653 & 654","275 Gallon",null,9006769,"General Purpose Cleaner","275 Gallon"]
[]
[null,null,"08683-5  08678-5","655 & 658 ","5 Gallon",null,9006776,"High Alkaline Degreaser","2 -2.5G "]
[null,null,"08683-15  08678-15","655 & 658","15 Gallon",null,9006777,"High Alkaline Degreaser","15 Gallon"]
[null,null,"08683-55  08678-55","655 & 658","55 Gallon",null,9006779,"High Alkaline Degreaser","55 Gallon"]
[null,null,"9000405  9000407","655 & 658","275 Gallon",null,9006781,"High Alkaline Degreaser","275 Gallon"]
[]
[null,null,"08690-1  08690-5  08684-5","9960 & 698","5 Gallon",null,9006770,"Solvent Based Degreaser","2 -2.5G "]
[null,null,"08690-55   08684-55","9960 & 698","55 Gallon",null,9006773,"Solvent Based Degreaser","55 Gallon"]
[]
[null,null,"08584-4",601,"22Lb. Carton",null,9006782,"High Alkaline Granular","22Lb. Carton"]
[null,null,"08584-2",601,"250Lb. Drum",null,9006783,"High Alkaline Granular","250Lb. Drum"]

{"sheet":"5680","index":5,"n_rows":455,"n_cols":14,"rows_kept":455,"cut":false,"hidden":false,"merged":[[327,5,327,6],[329,5,329,6],[28,2,28,6],[29,2,29,6],[50,2,50,5],[51,2,51,5],[326,5,326,6],[327,3,327,4],[326,3,326,4],[373,4,373,6],[378,2,378,5],[328,3,328,4],[328,5,328,6],[329,3,329,4],[334,4,334,8],[354,2,354,6],[346,7,346,8],[342,7,342,8],[343,5,343,6],[343,7,343,8],[341,7,341,8],[344,3,344,4],[349,7,349,8],[347,3,347,4],[330,5,330,6],[0,2,0,3],[1,2,1,3],[2,2,2,3],[3,2,3,3],[11,2,11,6],[27,2,27,6],[24,2,24,3],[379,2,379,5],[331,5,331,6],[341,5,341,6],[338,3,338,4],[339,3,339,4],[336,3,336,6],[346,3,346,4],[346,5,346,6],[349,3,349,4],[349,5,349,6],[330,3,330,4],[331,3,331,4],[341,3,341,4],[343,3,343,4],[400,4,400,5],[387,4,387,6],[375,2,375,5],[376,2,376,5],[377,2,377,5],[391,2,391,4],[385,2,385,5],[382,2,382,5],[384,2,384,5],[383,2,383,5],[381,2,381,5],[347,5,347,6],[348,5,348,6],[347,7,347,8],[348,7,348,8],[348,3,348,4],[342,3,342,4],[342,5,342,6],[344,5,344,6],[344,7,344,8],[345,3,345,4],[345,5,345,6],[345,7,345,8]]}
[5680,null,{"$f":"Start_Here!$C$8","v":"Contact Name"}]
[null,null,{"$f":"Start_Here!$C$5","v":"Company Name"}]
[null,null,{"$f":"Start_Here!$C$6","v":"Address"}]
[null,null,{"$f":"Start_Here!$C$7","v":"City, State Zip"}]
[null,null,{"$f":"Start_Here!$C$39","v":"Rep Name"}]
[null,null,{"$f":"Start_Here!$C$35","v":"Tennant Sales and Service Company"}]
[null,null,{"$f":"Start_Here!$C$36","v":"701 North Lilac Drive"}]
[null,null,{"$f":"Start_Here!$C$38","v":"Minneapolis, MN 55440-1452"}]
[null,null,{"$f":"Start_Here!$C$41","v":"800-553-8033"},null,"Quote Date :",null,{"$f":"Letter!$A$25","v":"2014-10-02"}]
[]
[]
[null,null,"BUILT-IN “TENNANT VALUE” INCLUDES:"]
[]
[null,null,"Quick-TrainTM Operator Controls",null,"Solution On/Off w/ Brushes"]
[null,null,"Linatex Squeegee Blades",null,"Auto On/Off w/ Propel"]
[null,null,"Wet 240AH C/20 Batteries (6)",null,"Key Switch"]
[null,null,"21 Amp Smart Charger",null,"Hour Meter"]
[null,null,"Low Profile Scrubhead and Squeegee Assembly",null,"Battery Discharge Indicator"]
[null,null,"Two Position Down Pressure",null,"Std Scrubbing Brushes or Pad Drivers(Select One)"]
[null,null,"Foam Filled Gray Non-Marking Tires",null,"FaST® Includes: "]
[null,null,"Adjustable Operator Console",null," (Available on 700 & 800mm/28 & 32-inch models only)"]
[null,null,"Gray Foam-Filled Rubber Tires",null,"Foam Scrubbing Technology System"]
[null,null,"ec-H2O NanoCleanTM Equipped Models Include:",null,"Two Scrubbing Modes: FaST® & Conventional Scrubbing"]
[null,null,"Electrically Converted Water Technology System",null,"On-Board  FaST-PAK® 2L Detergent Cartridge (Select One)"]
[null,null,"Two Scrubbing Modes: ec-H2O NanoCleanTM & Conventional Scrubbing",null,"  (See Note 1) - for additional Benefits"]
[]
[]
[null,null,"TENNANT COMPANY WARRANTY"]
[null,null,"3 YEARS OR 2500 HOURS ON ALL COMPONENTS, 3 YEARS LABOR"]
[null,null,"90 DAYS TRAVEL, 10 YEARS ON DURAMERTM TANKS"]
[]
[]
[]
[]
[]
[null,null,null,null,"                Quote Request Information"]
[null,null,null,null,null,null,"Fax (quote only)"]
[null,null,null,null,null,null,"Mail (quote,lit, specs)"]
[null,null,null,null,null,null,"Fax + Mail"]
[]
[]
[null,null,"Description","Reference No.","Canada Price","Qty.","Extended Price"]
[null,"Pre-Configured Machines (Note 1)",null,null,null,{"$f":"SUM(F44:F49)","v":0}]
[null,null,"700mm / 28\" Disk, Conventional Scrubbing, Standard Squeegee, 240AH Battery, Off-Board Charger","MV-5680-0024",18149,null,{"$f":"F44*E44","v":0}]
[null,null,"700mm / 28\" Disk, Conventional Scrubbing, Standard Squeegee, 360AH Battery, Off-Board Charger","MV-5680-0025",18863,null,0]
[null,null,"700mm / 28\" Disk, ec-H2O NanoClean, Standard Squeegee, 360AH Battery, Off-Board Charger","MV-5680-0026",21803,0,0]
[null,null,"800mm / 32\" Disk, Conventional Scrubbing, Standard Squeegee, 240AH Battery, Off-Board Charger","MV-5680-0027",18951,null,0]
[null,null,"800mm / 32\" Disk, Conventional Scrubbing, Standard Squeegee, 360AH Battery, Off-Board Charger","MV-5680-0028",19665,null,0]
[null,null,"800mm / 32\" Disk, ec-H2O NanoClean, Standard Squeegee, 360AH Battery, Off-Board Charger","MV-5680-0029",22605,null,0]
[]
[null,null,"Above unit(s) include Pad Drivers, Standard Width Squeegee with Linatex blades, and both an English and French Operator Manual."]
[null,null,"All Pre-Configured Machines are packaged in a Skid w/Carton for shipment via LTL carriers.  No additional options can be added or changed."]
[]
[]
[null,"Base Configuration",null,null,null,{"$f":"SUM(F56,F64,F68,F72,F81)","v":0}]
[null,null,"Cleaning Type",null,null,{"$f":"SUM(F57:F62)","v":0},null,null,null,null,null,{"$f":"SUM(F56)","v":0},"Surcharge Qty"]
[null,null,"5680 Walk-Behind Scrubber  700 mm/28\" - Disk","5680-700-D",18149,null,{"$f":"F57*E57","v":0},null,null,null,null,0,"Surcharge Qty"]
[null,null,"5680 Walk-Behind Scrubber  800 mm/32\" - Disk","5680-800-D",18951,null,0,null,null,null,null,0,"Surcharge Qty"]
[null,null,"5680 Walk-Behind Scrubber  900mm/ 36\" - Disk","5680-900-D",20558,null,0,null,null,null,null,0,"Surcharge Qty"]
[null,null,"5680 Walk-Behind Scrubber  700 mm/28\" - Cylindrical","5680-700-C",19754,null,0,null,null,null,null,0,"Surcharge Qty"]
[null,null,"5680 Walk-Behind Scrubber  800 mm/32\" - Cylindrical","5680-800-C",20558,null,0,null,null,null,null,0,"Surcharge Qty"]
[null,null,"5680 Walk-Behind Scrubber  900mm/ 36\" - Cylindrical","5680-900-C",22162,null,0,null,null,null,null,0,"Surcharge Qty"]
[null,null,null,null,null,null,null,null,null,null,null,0,"Surcharge Qty"]
[null,null,"Cleaning Technology: (conventional is standard,  ec-H2O NanoClean or FaST: can also operate in conventional mode)",null,"CAD Price",{"$f":"SUM(F65:F66)","v":0},null,null,null,null,null,{"$f":"SUM(F64)","v":0},"Surcharge Qty"]
[null,null,"ec-H2O NanoClean™","ec-H2ONC-5680",2940,null,{"$f":"F65*E65","v":0},null,null,null,null,0,"Surcharge Qty"]
[null,null,"FaST® (Note 2)","FaST-5680",2704,null,{"$f":"F66*E66","v":0},null,null,null,null,{"$f":"SUM(F66)","v":0},"Surcharge Qty"]
[null,null,null,null,null,null,null,null,null,null,null,{"$f":"SUM(F67)","v":0},"Surcharge Qty"]
[null,null,"Squeegee Width (See Note 3)",null,null,{"$f":"SUM(F69:F70)","v":0},null,null,null,null,null,{"$f":"SUM(F68)","v":0},"Surcharge Qty"]
[null,null,"Standard","STD-5680","N/C",null,{"$f":"IF(F69=0,\" \",\"N/C\")","v":" "},null,null,null,null,0,"Surcharge Qty"]
[null,null,"Narrow Aisle","NR-5680","N/C",null,{"$f":"IF(F70=0,\" \",\"N/C\")","v":" "},null,null,null,null,0,"Surcharge Qty"]
[null,null,null,null,null,null,null,null,null,null,null,0,"Surcharge Qty"]
[null,null,"Battery Type",null,null,{"$f":"SUM(F73:F79)","v":0}]
[null,null,"Wet 240AH C/20  (Kit of 6 batteries)",222359,"N/C",null,{"$f":"IF(F73=0,\" \",\"N/C\")","v":" "}]
[null,null,"Wet 360AH C/20  (Kit of 6 batteries)",222357,714,null,{"$f":"F74*E74","v":0}]
[null,null,"Sealed/MF Gel 180AH C/20  (Kit of 6 batteries)",324442,2429,null,{"$f":"F75*E75","v":0}]
[null,null,"Sealed/MF AGM 220AH C/20  (Kit of 6 batteries)",424444,2177,null,{"$f":"F76*E76","v":0}]
[null,null,"Without Battery",null,-1181,null,{"$f":"F77*E77","v":0}]
[]
[null,null,"HydroLink® Battery Watering Kit  (Note 4)",9009620,698,null,{"$f":"F79*E79","v":0}]
[]
[null,null,"Charger",null,null,{"$f":"SUM(F82:F88)","v":0}]
[null,null,"21A 85-265V AC 50/60Hz 1 Ph (for 240AH batteries)",9001051,"N/C",null,{"$f":"IF(F82=0,\" \",\"N/C\")","v":" "}]
[null,null,"21A 85-265V AC 50/60Hz 1 Ph (for 360AH batteries)",9004241,"N/C",null,{"$f":"IF(F83=0,\" \",\"N/C\")","v":" "}]
[null,null,"21A 85-265V AC 50/60Hz 1 Ph (for AGM batteries)",9008267,"N/C",null,{"$f":"IF(F84=0,\" \",\"N/C\")","v":" "}]
[null,null,"21A 85-265V AC 50/60Hz 1 Ph (for GEL batteries)",9008266,"N/C",null,{"$f":"IF(F85=0,\" \",\"N/C\")","v":" "}]
[null,null,"20A 85-130V AC 50/60Hz 1Ph - On Board (for 240AH and 360AH batteries)",9004293,656,null,{"$f":"F86*E86","v":0}]
[null,null,"36A 120V AC 60Hz 1Ph (for 360AH batteries) in lieu of standard",602003,822,null,{"$f":"F87*E87","v":0}]
[null,null,"Without  Charger",null,-822,null,{"$f":"F88*E88","v":0}]
[]
[null,"Cleaning Performance",null,"Reference #",null,{"$f":"SUM(F91:F93)","v":0}]
[null,null,"Recovery Tank Debris Tray",1042996,103.8,null,{"$f":"F91*E91","v":0}]
[]
[null,null,"FaST ® Detergent (Note 5)",null,null,{"$f":"SUM(F94:F96)","v":0}]
[null,null,"FaST®  365 (2L) - Neutral Cleaner",1017015,"N/C",null,{"$f":"IF(F94=0,\" \",\"N/C\")","v":" "}]
[null,null,"FaST®  665 (2L) - Degreaser",1017022,"N/C",null,{"$f":"IF(F95=0,\" \",\"N/C\")","v":" "}]
[null,null,"FaST®  965 (2L) - HD Degreaser",9002021,"N/C",null,{"$f":"IF(F96=0,\" \",\"N/C\")","v":" "}]
[]
[null,"Machine Protection & Safety",null,"Reference #",null,{"$f":"SUM(F99:F105)","v":0}]
[null,null,"Tires, Gray Foam-Filled Rubber",374047,"N/C",null,{"$f":"IF(F99=0,\" \",\"N/C\")","v":" "}]
[null,null,"Tires, Black Pneumatic Rubber  (Note 6)",9002744,"N/C",null,{"$f":"IF(F100=0,\" \",\"N/C\")","v":" "}]
[null,null,"Tires, Black Foam-Filled Rubber",374048,341,null,{"$f":"F101*E101","v":0}]
[null,null,"Tires, Black Solid Rubber ",222350,196,null,{"$f":"F102*E102","v":0}]
[null,null,"Tires, Gray Pneumatic Rubber  (Note 6)",374024,84,null,{"$f":"F103*E103","v":0}]
[]
[null,null,"Trailer Transport Kit",398029,31,null,{"$f":"F105*E105","v":0}]
[]
[null,"Brushes and Pads (Note 7)",null,"Reference #",null,{"$f":"SUM(F108,F121,F136,F149,F155,F161)","v":0}]
[null,null,"700mm/28\" Disk Scrubbing Brushes/Pads (2 Required - 14\" each)",null,null,{"$f":"SUM(F109:F119)","v":0}]
[null,null,"Polypropylene Brush",1220237,"N/C",null,{"$f":"IF(F109=0,\" \",\"N/C\")","v":" "}]
[null,null,"Nylon Brush",1220238,"N/C",null,{"$f":"IF(F110=0,\" \",\"N/C\")","v":" "}]
[null,null,"Super Abrasive Brush ",1220239,317,null,{"$f":"F111*E111","v":0}]
[]
[null,null,"Pad Driver",1220198,"N/C",null,{"$f":"IF(F113=0,\" \",\"N/C\")","v":" "}]
[null,null,"Pads ",null,null,{"$f":"SUM(F115:F119)","v":0}]
[null,null,"Brown Stripping  - 3M ",222327,16.600000000000001,null,{"$f":"F115*E115","v":0}]
[null,null,"Blue Scrubbing - 3M   ",222326,16.600000000000001,null,{"$f":"F116*E116","v":0}]
[null,null,"Red Cleaning - 3M         ",222325,16.600000000000001,null,{"$f":"F117*E117","v":0}]
[null,null,"White Polishing - 3M         ",222324,16.600000000000001,null,{"$f":"F118*E118","v":0}]
[null,null,"Black Stripping-Hi Pro - 3M         ",370091,19.600000000000001,null,{"$f":"F119*E119","v":0}]
[]
[null,null,"800mm/32\" Disk Scrubbing Brushes/Pads (2 Required - 16\" each)",null,null,{"$f":"SUM(F122:F134)","v":0}]
[null,null,"Polypropylene Brush",1220241,"N/C",null,{"$f":"IF(F122=0,\" \",\"N/C\")","v":" "}]
[null,null,"Heavy Duty Polypropylene Brush",1220236,"N/C",null,{"$f":"IF(F123=0,\" \",\"N/C\")","v":" "}]
[null,null,"Nylon Brush",1220235,"N/C",null,{"$f":"IF(F124=0,\" \",\"N/C\")","v":" "}]
[null,null,"Super Abrasive Brush ",1221543,317,null,{"$f":"F125*E125","v":0}]
[null,null,"Crinkle Wire Brush",1220234,317,null,{"$f":"F126*E126","v":0}]
[]
[null,null,"Pad Driver",1220199,"N/C",null,{"$f":"IF(F128=0,\" \",\"N/C\")","v":" "}]
[null,null,"Pads ",null,null,{"$f":"SUM(F130:F134)","v":0}]
[null,null,"Brown Stripping  - 3M ","63248-1",19.600000000000001,null,{"$f":"F130*E130","v":0}]
[null,null,"Blue Scrubbing - 3M   ","63248-2",19.600000000000001,null,{"$f":"F131*E131","v":0}]
[null,null,"Red Cleaning - 3M         ","63248-3",19.600000000000001,null,{"$f":"F132*E132","v":0}]
[null,null,"White Polishing - 3M         ","63248-4",19.600000000000001,null,{"$f":"F133*E133","v":0}]
[null,null,"Black Stripping-Hi Pro - 3M         ",370092,31.8,null,{"$f":"F134*E134","v":0}]
[]
[null,null,"900mm/36\" Disk Scrubbing Brushes/Pads (2 Required - 18\" each)",null,null,{"$f":"SUM(F137:F147)","v":0}]
[null,null,"Polypropylene Brush",1220188,"N/C",null,{"$f":"IF(F137=0,\" \",\"N/C\")","v":" "}]
[null,null,"Nylon Brush",1220191,"N/C",null,{"$f":"IF(F138=0,\" \",\"N/C\")","v":" "}]
[null,null,"Super Abrasive Brush ",1220190,381,null,{"$f":"F139*E139","v":0}]
[]
[null,null,"Pad Driver",1220200,"N/C",null,{"$f":"IF(F141=0,\" \",\"N/C\")","v":" "}]
[null,null,"Pads ",null,null,{"$f":"SUM(F143:F147)","v":0}]
[null,null,"Brown Stripping  - 3M ",11777,22.4,null,{"$f":"F143*E143","v":0}]
[null,null,"Blue Scrubbing - 3M   ",11778,22.4,null,{"$f":"F144*E144","v":0}]
[null,null,"Red Cleaning - 3M         ",11780,22.4,null,{"$f":"F145*E145","v":0}]
[null,null,"White Polishing - 3M         ",11781,22.4,null,{"$f":"F146*E146","v":0}]
[null,null,"Black Stripping-Hi Pro - 3M         ",370093,24,null,{"$f":"F147*E147","v":0}]
[]
[null,null,"700mm/28\" Cylindrical Scrubbing Brushes  (2 Required)",null,null,{"$f":"SUM(F150:F153)","v":0}]
[null,null,"Polypropylene Brush",222304,"N/C",null,{"$f":"IF(F150=0,\" \",\"N/C\")","v":" "}]
[null,null,"Heavy Duty Polypropylene Brush",374041,"N/C",null,{"$f":"IF(F151=0,\" \",\"N/C\")","v":" "}]
[null,null,"Nylon Brush",222305,"N/C",null,{"$f":"IF(F152=0,\" \",\"N/C\")","v":" "}]
[null,null,"Abrasive Brush",222306,317,null,{"$f":"F153*E153","v":0}]
[]
[null,null,"800mm/32\" Cylindrical Scrubbing Brushes  (2 Required)",null,null,{"$f":"SUM(F156:F159)","v":0}]
[null,null,"Polypropylene Brush",222307,"N/C",null,{"$f":"IF(F156=0,\" \",\"N/C\")","v":" "}]
[null,null,"Heavy Duty Polypropylene Brush",374042,"N/C",null,{"$f":"IF(F157=0,\" \",\"N/C\")","v":" "}]
[null,null,"Nylon Brush",222308,"N/C",null,{"$f":"IF(F158=0,\" \",\"N/C\")","v":" "}]
[null,null,"Abrasive Brush",222309,317,null,{"$f":"F159*E159","v":0}]
[]
[null,null,"900mm/36\" Cylindrical Scrubbing Brushes  (2 Required)",null,null,{"$f":"SUM(F162:F165)","v":0}]
[null,null,"Polypropylene Brush",222310,"N/C",null,{"$f":"IF(F162=0,\" \",\"N/C\")","v":" "}]
[null,null,"Heavy Duty Polypropylene Brush",374043,"N/C",null,{"$f":"IF(F163=0,\" \",\"N/C\")","v":" "}]
[null,null,"Nylon Brush",222311,"N/C",null,{"$f":"IF(F164=0,\" \",\"N/C\")","v":" "}]
[null,null,"Abrasive Brush",222312,317,null,{"$f":"F165*E165","v":0}]
[]
[null,"Support",null,"Reference #",null,{"$f":"SUM(F168:F176)","v":0}]
[null,null,"5680 Operator Manual (English)",331176,"N/C",null,{"$f":"IF(F168=0,\" \",\"N/C\")","v":" "}]
[null,null,"5680 Operator Manual (French)  (Note 8)",331541,"N/C",null,{"$f":"IF(F169=0,\" \",\"N/C\")","v":" "}]
[null,null,"Additional Operator Manual","See above",54,null,{"$f":"F170*E170","v":0}]
[null,null,"5680 Parts Manual",331178,14,null,{"$f":"F171*E171","v":0}]
[null,null,"Additional Parts Manual","See above",90,null,{"$f":"F172*E172","v":0}]
[null,null,"5680 Operator Video (CD)",1059845,"N/C",null,{"$f":"IF(F173=0,\" \",\"N/C\")","v":" "}]
[null,null,"Additional Operator Video","See above",40.6,null,{"$f":"F174*E174","v":0}]
[]
[null,null,"Packaging",null,null,{"$f":"SUM(F177:F177)","v":0}]
[null,null,"Skid w/Carton, Stackable",9001553,"N/C",null,{"$f":"IF(F177=0,\" \",\"N/C\")","v":" "}]
[]
[null,"AFTERMARKET ITEMS (ordered separately) :",null,null,null,{"$f":"SUM(F181)","v":0}]
[]
[null,"Brushes, Pad Drivers and Pads (Replacements)",null,"Reference #","CAD Price",{"$f":"SUM(F182,F196,F213,F227,F233,F239)","v":0}]
[null,null,"700mm/28\" Disk Scrubbing Brushes/Pads (2 Required - 14\" each)",null,null,{"$f":"SUM(F183:F194)","v":0}]
[null,null,"Polypropylene Brush",1220237,219.29999999999998,null,{"$f":"F183*E183","v":0}]
[null,null,"Nylon Brush",1220238,319.10000000000002,null,{"$f":"F184*E184","v":0}]
[null,null,"Super Abrasive Brush ",1220239,459,null,{"$f":"F185*E185","v":0}]
[]
[null,null,"Pad Driver",1220198,349.90000000000003,null,{"$f":"F187*E187","v":0}]
[null,null,"Pads ",null,null,{"$f":"SUM(F189:F194)","v":0}]
[null,null,"Brown Stripping  - 3M ",222327,16.600000000000001,null,{"$f":"F189*E189","v":0}]
[null,null,"Blue Scrubbing - 3M   ",222326,16.600000000000001,null,0]
[null,null,"Red Cleaning - 3M         ",222325,16.600000000000001,null,0]
[null,null,"White Polishing - 3M         ",222324,16.600000000000001,null,0]
[null,null,"Black Stripping-Hi Pro - 3M         ",370091,19.600000000000001,null,0]
[null,null,"Maroon Surface Prep Pad - 3M         ",1051026,18.700000000000003,null,0]
[]
[null,null,"800mm/32\" Disk Scrubbing Brushes/Pads (2 Required - 16\" each)",null,null,{"$f":"SUM(F197:F211)","v":0}]
[null,null,"Polypropylene Brush",1220241,261.8,null,{"$f":"F197*E197","v":0}]
[null,null,"Heavy Duty Polypropylene Brush",1220236,284.89999999999998,null,0]
[null,null,"Nylon Brush",1220235,352,null,0]
[null,null,"Bassine Brush",1220233,344.4,null,0]
[null,null,"Super Abrasive Brush ",1221543,475.5,null,0]
[null,null,"Crinkle Wire Brush",1220234,612.70000000000005,null,0]
[]
[null,null,"Pad Driver",1220199,393.90000000000003,null,{"$f":"F204*E204","v":0}]
[null,null,"Pads ",null,null,{"$f":"SUM(F206:F211)","v":0}]
[null,null,"Brown Stripping  - 3M ","63248-1",19.600000000000001,null,{"$f":"F206*E206","v":0}]
[null,null,"Blue Scrubbing - 3M   ","63248-2",19.600000000000001,null,0]
[null,null,"Red Cleaning - 3M         ","63248-3",19.600000000000001,null,0]
[null,null,"White Polishing - 3M         ","63248-4",19.600000000000001,null,0]
[null,null,"Black Stripping-Hi Pro - 3M         ",370092,31.8,null,0]
[null,null,"Maroon Surface Prep Pad - 3M         ",1051027,23.8,null,0]
[]
[null,null,"900mm/36\" Disk Scrubbing Brushes/Pads (2 Required - 18\" each)",null,null,{"$f":"SUM(F214:F225)","v":0}]
[null,null,"Polypropylene Brush",1220188,315.5,null,{"$f":"F214*E214","v":0}]
[null,null,"Nylon Brush",1220191,403.5,null,{"$f":"F215*E215","v":0}]
[null,null,"Super Abrasive Brush ",1220190,628.1,null,{"$f":"F216*E216","v":0}]
[]
[null,null,"Pad Driver",1220200,393.90000000000003,null,{"$f":"F218*E218","v":0}]
[null,null,"Pads ",null,null,{"$f":"SUM(F220:F225)","v":0}]
[null,null,"Brown Stripping  - 3M ",11777,22.4,null,{"$f":"F220*E220","v":0}]
[null,null,"Blue Scrubbing - 3M   ",11778,22.4,null,0]
[null,null,"Red Cleaning - 3M         ",11780,22.4,null,0]
[null,null,"White Polishing - 3M         ",11781,22.4,null,0]
[null,null,"Black Stripping-Hi Pro - 3M         ",370093,24,null,0]
[null,null,"Maroon Surface Prep Pad - 3M         ",1051029,28.3,null,0]
[]
[null,null,"700mm/28\" Cylindrical Scrubbing Brushes  (2 Required)",null,null,{"$f":"SUM(F228:F231)","v":0}]
[null,null,"Polypropylene",222304,190.9,null,{"$f":"F228*E228","v":0}]
[null,null,"Heavy Duty Polypropylene",374041,191.29999999999998,null,{"$f":"F229*E229","v":0}]
[null,null,"Nylon",222305,280,null,{"$f":"F230*E230","v":0}]
[null,null,"Abrasive",222306,403,null,{"$f":"F231*E231","v":0}]
[]
[null,null,"800mm/32\" Cylindrical Scrubbing Brushes  (2 Required)",null,null,{"$f":"SUM(F234:F237)","v":0}]
[null,null,"Polypropylene",222307,215.2,null,{"$f":"F234*E234","v":0}]
[null,null,"Heavy Duty Polypropylene",374042,213.5,null,{"$f":"F235*E235","v":0}]
[null,null,"Nylon",222308,312.70000000000005,null,{"$f":"F236*E236","v":0}]
[null,null,"Abrasive",222309,464.8,null,{"$f":"F237*E237","v":0}]
[]
[null,null,"900mm/36\" Cylindrical Scrubbing Brushes  (2 Required)",null,null,{"$f":"SUM(F240:F243)","v":0}]
[null,null,"Polypropylene Brush",222310,257.90000000000003,null,{"$f":"F240*E240","v":0}]
[null,null,"Heavy Duty Polypropylene Brush",374043,256.40000000000003,null,{"$f":"F241*E241","v":0}]
[null,null,"Nylon Brush",222311,346.70000000000005,null,{"$f":"F242*E242","v":0}]
[null,null,"Abrasive Brush",222312,617.20000000000005,null,{"$f":"F243*E243","v":0}]
[]
[null,"Aftermarket FaST-PAK ® Detergent ",null,null,null,{"$f":"SUM(F246:F248)","v":0}]
[null,null,"FaST®  365 (2L) - Neutral Cleaner",1017015,189.7,null,{"$f":"F246*E246","v":0}]
[null,null,"FaST®  665 (2L) - Degreaser",1017022,346,null,{"$f":"F247*E247","v":0}]
[null,null,"FaST®  965 (2L) - HD Degreaser",9002021,447.6,null,{"$f":"F248*E248","v":0}]
[]
[null,"Aftermarket Maintenance Items  (Ordered separately)",null,"Reference #",null,{"$f":"SUM(F251,F267:F268)","v":0}]
[null,null,"Disk & Cylindrical Brush Versions",null,null,{"$f":"SUM(F252,F257,F262)","v":0}]
[null,null,"700mm/28\" ",null,null,{"$f":"SUM(F253:F255)","v":0}]
[null,null,"Front - Standard Linard Squeegee Blade - 700mm/28\" with Air-Control Slots",222381,28,null,{"$f":"F253*E253","v":0}]
[null,null,"Rear - Standard Linatex Squeegee Blade - 700mm/28\" ",222382,35.5,null,{"$f":"F254*E254","v":0}]
[null,null,"700mm/28\" Cylindrical Scrub Head Skirt Kit",222711,103.89999999999999,null,{"$f":"F255*E255","v":0}]
[]
[null,null,"800mm/32\" ",null,null,{"$f":"SUM(F258:F260)","v":0}]
[null,null,"Front - Standard Linard Squeegee Blade - 800mm/32\" with Air-Control Slots",222241,32.200000000000003,null,{"$f":"F258*E258","v":0}]
[null,null,"Rear - Standard Linatex Squeegee Blade - 800mm/32\" ",222242,46.800000000000004,null,{"$f":"F259*E259","v":0}]
[null,null,"800mm/32\" Cylindrical Scrub Head Skirt Kit",222711,103.89999999999999,null,{"$f":"F260*E260","v":0}]
[]
[null,null,"900mm/36\"",null,null,{"$f":"SUM(F263:F265)","v":0}]
[null,null,"Front-Grouted, Linard Squeegee Blade with Tile Air-Control Slots - 900mm/36\" with Air-Control Slots",222413,38.700000000000003,null,{"$f":"F263*E263","v":0}]
[null,null,"Front-Standard Linard Squeegee Blade - 900mm/36\"",222414,31.700000000000003,null,{"$f":"F264*E264","v":0}]
[null,null,"Rear - Standard Linatex Squeegee Blade - 900mm/36\" ",222415,54.800000000000004,null,{"$f":"F265*E265","v":0}]
[]
[null,null,"Recovery Tank Debris Screen",1042996,103.8,null,{"$f":"F267*E267","v":0}]
[null,null,"HydroLink® Battery Watering Kit (for 240 AH and 360 AH batteries), for 36V system",9010301,323,null,{"$f":"F268*E268","v":0}]
[]
[]
[null,"Aftermarket - FINISHED CONCRETE SYSTEMS      No Additional Discounts Allowed",null,null,null,{"$f":"SUM(F272:F301)","v":0}]
[null,null,"14 in - 25/35 grit CCW Concrete Tool (Counter-clockwise)",1059815,788.2,null,{"$f":"F272*E272","v":0}]
[null,null,"14 in - 25/35 grit CW Concrete Tool (Clockwise)",1059819,788.2,null,0]
[null,null,"16 in - 25/35 grit CCW Concrete Tool (Counter-clockwise)",1059824,803.1,null,0]
[null,null,"16 in - 25/35 grit CW Concrete Tool (Clockwise)",1059822,803.1,null,0]
[null,null,"18 in - 25/35 grit CCW Concrete Tool (Counter-clockwise)",1059826,841,null,0]
[null,null,"18 in - 25/35 grit CW Concrete Tool (Clockwise)",1059858,841,null,0]
[null,null,"14 in - 100 grit CCW Concrete Tool (Counter-clockwise)",1059812,788.2,null,0]
[null,null,"14 in - 100 grit CW Concrete Tool (Clockwise)",1059809,788.2,null,0]
[null,null,"16 in - 100 grit CCW Concrete Tool (Counter-clockwise)",1056956,803.1,null,0]
[null,null,"16 in - 100 grit CW Concrete Tool (Clockwise)",1056957,803.1,null,0]
[null,null,"18 in - 100 grit CCW Concrete Tool (Counter-clockwise)",1057117,841,null,0]
[null,null,"18 in - 100 grit CW Concrete Tool (Clockwise)",1057120,841,null,0]
[null,null,"14 in - 50 Grit Polymer Tool (Brown Blade)",1059717,851.2,null,0]
[null,null,"14 in - 100 Grit Polymer Tool (Black Blade)",1059718,851.2,null,0]
[null,null,"14 in - 200 Grit Polymer Tool (Blue Blade)",1059719,823.5,null,0]
[null,null,"14 in - 400 Grit Polymer Tool (Green Blade)",1059720,823.5,null,0]
[null,null,"14 in - 1000 Grit Polymer Tool (Red Blade)",1059721,1105.0999999999999,null,0]
[null,null,"14 in - 2000 Grit Polymer Tool (Tan Blade)",1059747,1141.2,null,0]
[null,null,"16 in - 50 Grit Polymer Tool (Brown Blade)",1059748,867.1,null,0]
[null,null,"16 in - 100 Grit Polymer Tool (Black Blade)",1059749,839.2,null,0]
[null,null,"16 in - 200 Grit Polymer Tool (Blue Blade)",1059751,839.2,null,0]
[null,null,"16 in - 400 Grit Polymer Tool (Green Blade)",1059752,839.2,null,0]
[null,null,"16 in - 1000 Grit Polymer Tool (Red Blade)",1059753,1122,null,0]
[null,null,"16 in - 2000 Grit Polymer Tool (Tan Blade)",1059754,1158.5,null,0]
[null,null,"18 in - 50 Grit Polymer Tool (Brown Blade)",1059755,911.2,null,0]
[null,null,"18 in - 100 Grit Polymer Tool (Black Blade)",1059756,883.4,null,0]
[null,null,"18 in - 200 Grit Polymer Tool (Blue Blade)",1059757,883.4,null,0]
[null,null,"18 in - 400 Grit Polymer Tool (Green Blade)",1059758,883,null,0]
[null,null,"18 in - 1000 Grit Polymer Tool (Red Blade)",1059759,1169.5999999999999,null,0]
[null,null,"18 in - 2000 Grit Polymer Tool (Tan Blade)",1059760,1207.8,null,0]
[null,null,"Replacement Blades",null,null,{"$f":"SUM(F303:F310)","v":0}]
[null,null,"25/35 Grit Concrete Blades - 16/set",9007162,560,null,{"$f":"F303*E303","v":0}]
[null,null,"100 Grit Concrete Blades - 16/set",9006738,588,null,0]
[null,null," 50 Grit Polymer Blades - 11/set",1060171,184.4,null,0]
[null,null," 100 Grit Polymer Blades - 11/set",1060180,184.4,null,0]
[null,null," 200 Grit Polymer Blades - 11/set",1060181,184.4,null,0]
[null,null," 400 Grit Polymer Blades - 11/set",1060182,184.4,null,0]
[null,null," 1000 Grit Polymer Blades - 11/set",1060183,242.7,null,0]
[null,null," 2000 Grit Polymer Blades - 11/set",1060184,249.1,null,0]
[null,null,"Concrete Finisher - Maintainer ",null,null,{"$f":"SUM(F312:F313)","v":0}]
[null,null,"Concrete Finisher-Maintainer - 15 Gallon",9006838,393,null,{"$f":"F312*E312","v":0}]
[null,null,"Concrete Finisher-Maintainer - 55 Gallon",9006839,1357.8,null,{"$f":"F313*E313","v":0}]
[]
[null,"Custom Solution--write in description, qty, price, and PN if applicable",null,null,null,{"$f":"SUM(F316)","v":0}]
[null,null,null,null,"Insert Prices Here",{"$f":"SUM(F317:F320)","v":0}]
[null,null,null,"Custom",null,{"$f":"IF(E317 <> \"\", 1, 0)","v":0},{"$f":"F317*E317","v":0}]
[null,null,null,"Custom",null,{"$f":"IF(E318 <> \"\", 1, 0)","v":0},{"$f":"F318*E318","v":0}]
[null,null,null,"Custom",null,{"$f":"IF(E319 <> \"\", 1, 0)","v":0},{"$f":"F319*E319","v":0}]
[null,null,null,"Custom",null,{"$f":"IF(E320 <> \"\", 1, 0)","v":0},{"$f":"F320*E320","v":0}]
[null,null,"Prepaid and Add","Freight",null,1,{"$f":"F321*E321","v":0}]
[null,null,"Subject to all applicable taxes","Tax",null,1,{"$f":"F322*E322","v":0}]
[]
[null,null,null,"MACHINE TOTAL*",null,null,{"$f":"SUM(G44:G322)","v":0},null,null,null,null,null,null,"This goes to \"My Documents\""]
[null,null,null,null,null,null,{"$f":"SUM(G324)","v":0}]
[]
[null,null,"National Leasing - Leasing Calculation Option:","Finance Option 1",null,"Finance Option 2",null,null,{"$f":"Financing!A38","v":"Rates 2016 - Rev. 7/1/2016"}]
[null,null,"Purchase Option:",1,null,"FMV Scrubber",null,null,{"$f":"Financing!A39","v":"“Blank Payment Amounts Indicate The Financing Option Or Purchase Options Selected Are Not "}]
[null,null,"24 Months",0,null,0,null,null,{"$f":"Financing!A40","v":"Applicable Or The Machine Total Is Below The Minimum Amount For The Selected Vendor”"}]
[null,null,"36 Months",0,null,0,null,null,{"$f":"Financing!A41","v":"\"Quoted monthly payments are estimates only and are based on a certain level of credit rating."}]
[null,null,"48 Months",0,null,0,null,null,{"$f":"Financing!A42","v":"Actual monthly payments may be higher depending on your credit rating.\""}]
[null,null,"60 Months",0,null,0,null,null,{"$f":"Financing!A43","v":"“Financing rates do not include Pre-Paid Service”"}]
[null,"   TennantTrue",null,null,0,0]
[]
[null,null,"Is customer interested in service program?","Yes","*State/County selection required for TennantTrue service options"]
[]
[null,null,"If not, why?"]
[]
[null,null,"Term:",36,null,null,"AB Brushes","No"]
[null,null,"Monthly machine usage (hrs):",25]
[]
[null,null,"TennantTrue: ","Rate Per Unit",null,"Hourly Labor Rate",null,"Site Visit Charge"]
[null,null,"Gold - Monthly",75]
[null,null,"Gold - Pre Pay Full Term",2511]
[null,null,"Silver - Monthly",60]
[null,null,"Silver - Annually",703]
[null,null,"Silver - Pre Pay Full Term",2063]
[null,null,"Silver - Per Visit",350]
[null,null,"Pay As You Go",null,null,null,null,null,null,null,"*State/County selection required for 'Pay As You Go' and 'On Demand'."]
[null,null,"On Demand"]
[]
[]
[]
[null,null,"Quote Special Instructions:"]
[]
[]
[null,null,{"$f":"Start_Here!E33","v":"Terms and Conditions"}]
[null,null,{"$f":"Start_Here!E34","v":"Ask your local sales rep for estimated lead times. Verify when placing order"}]
[null,null,{"$f":"Start_Here!E35","v":"All orders subject to acceptance by Tennant Sales and Service Company, Minneapolis, Minnesota"}]
[null,null,{"$f":"Start_Here!E36","v":"Prices subject to change without notice. Subject to any applicable taxes."}]
[null,null,{"$f":"Start_Here!E37","v":"Terms:  Net 30 days.  Payable in Canadian Funds"}]
[null,null,{"$f":"Start_Here!E38","v":"Freight:  Accessories, parts, supplies, detergents, and floor coatings orders delivered DDP "}]
[null,null,{"$f":"Start_Here!E39","v":"shipping point Frt PPD.  Machine orders delivered DDP shipping point Frt PPD and add."}]
[null,null,{"$f":"Start_Here!E40","v":"Returned Merchandise is subject to a restocking fee."}]
[null,null,{"$f":"Start_Here!E42","v":"Printed General Terms and Conditions are also available upon request."}]
[null,null,{"$f":"Start_Here!E43","v":0}]
[]
[]
[null,null,null,null,"Quote Date :",null,{"$f":"Letter!$A$25","v":"2014-10-02"}]
["Order Placement Information:  To place your order, fill in PO# and customer signatures,"]
["call or fax to the numbers listed below. Customer Purchase Order is required."]
["If information is missing, orders will be entered and held until all information is received."]
[null,null,"Customer Number",null,{"$f":"Start_Here!F15","v":"Cust Grp 3"}]
[null,null,{"$f":"Start_Here!$F$5","v":0},null,{"$f":"Start_Here!F16","v":0}]
[null,null,{"$f":"Start_Here!$B$18","v":"Sold To Information (Please Verify)"}]
["Company",null,{"$f":"Start_Here!$C$19","v":""}]
["Address",null,{"$f":"Start_Here!$C$20","v":""}]
[null,null,{"$f":"Start_Here!$C$21","v":""}]
["Name",null,{"$f":"Start_Here!$C$22","v":""}]
["Phone",null,{"$f":"Start_Here!$C$23","v":""}]
[null,null,{"$f":"Start_Here!$B$11","v":"Ship To Information (Please Verify)"}]
["Company",null,{"$f":"Start_Here!$C$12","v":""}]
["Address",null,{"$f":"Start_Here!$C$13","v":""}]
[null,null,{"$f":"Start_Here!$C$14","v":""}]
["Name",null,{"$f":"Start_Here!$C$15","v":""}]
["Phone",null,{"$f":"Start_Here!$C$16","v":""}]
[null,null,{"$f":"Start_Here!$B$25","v":"Shipping/Carrier Instructions:"},null,"Order Special Instructions:"]
[null,null,{"$f":"Start_Here!$C$26","v":0}]
[]
[null,null," Customer Purchase Order No. "]
[null,null," (please attach copy) "]
[]
[]
[null,null," Tax Exempt ",null," Yes "]
[null,null,null,null," No "]
[null,null," If Yes, attach a copy of your exemption certificate. "]
[]
[null,null," Requested Delivery Date "]
[null,null,{"$f":"Start_Here!$F$14","v":0}]
[]
[null,null,{"$f":"Start_Here!$F$8","v":0},null,{"$f":"Start_Here!$F$11","v":0}]
[null,null," Authorized Buyer (please print) ",null," Phone Number "]
[]
[null,null," Authorized Buyer Signature "]
[]
[null,null,"Tennant Representative"]
[]
["Specialized Maintenance Equipment"]
[{"$f":"Start_Here!$C$45","v":"TENNANT · 701 NORTH LILAC DRIVE · P.O. BOX 1452 · MINNEAPOLIS, MN 55440-1452 ·"}]
[{"$f":"Start_Here!$C$46","v":" PHONE:800-553-8033 · FAX:763-513-2116"}]
[]
[null,"Special Information "]
[]
[null,1,"Pre-Configured Machines cannot add or change options.  All units are shipped via stackable skid with carton."]
[null,null,"When ordering, provide the reference number listed above.  Price does not include freight or tax.  Availability of units "]
[null,null,"and lead time may vary."]
[]
[null,2,"FaST cleaning technology is only available on the 700mm/28\" and 800mm/32\" scrub head sizes for both Disk and Cylindrical."]
[]
[null,3,"Standard Squeegee recovers 100% of water in 180º point turns.  If customer has a narrow aisle, the machine can be"]
[null,null,"set-up for a narrow aisle squeegee.  The narrow-aisle squeegee is the squeegee that comes standard with the "]
[null,null,"next size smaller head and will not recover 100% of the solution in 180º point turns."]
[]
[null,null,"Scrub Head Size","Standard Squeegee","Narrow Aisle"]
[null,null,"700 mm / 28\"","700 mm / 28\" - 397751","550 mm / 22\" - 374032"]
[null,null,"800 mm / 32\"","800 mm / 32\" - 397749","700 mm / 28\" - 397751"]
[null,null,"900 mm / 36\"","900 mm / 36\" - 397750","800 mm / 32\" - 397749"]
[]
[null,4,"Only available on wet batteries, not sealed."]
[]
[null,5,"Only available on FaST models.  FaSTTM Floor Cleaning Concentrate FaST-PAKTM Cartridges. Proprietary super concentrated cleaners "]
[null,null,"for use on Tennant machines with FaSTTM Foam Scrubbing Technology Systems. One 2 liter FaST-PAKTM cartridge cleans one "]
[null,null,"million square feet (90,000m2).  Biodegradable. Phosphate free.  Safe for use on hard floors such as finished or  "]
[null,null,"unfinished VCT, Terrazzo,  Finished Wood, Marble, sealed or unsealed Concrete, Urethane or Epoxy coated surfaces. "]
[null,null,"One FaST-PAK comes with the machine - customer may select from either FaST 365, 665 or 965  Detergent."]
[]
[null,6,"Pneumatic Tire options are not available with units equipped with a Cylindrical Scrub Head."]
[]
[null,7,"One set of brushes or pad drivers come standard with a 5680."]
[]
[null,8,"A French and English manual will be supplied for all units shipping into Quebec, Canada at no charge.  An additional manual"]
[null,null,"can be ordered (for a total of 3 manuals) for an additional charge as stated under 'Additional Operator Manual'."]
[]
[null,9,"Pre-Paid and Monthly Packages are available for the IRIS Information Service. IRIS Module is required and NOT included in the price of the IRIS Information Service:"]
[null,null,"3 Year Pre-Paid IRIS Information Service                 $350.00"]
[null,null,"5 Year Pre-Paid IRIS Information Service                 $560.00"]
[null,null,"A monthly contract can be set up at $14 per month w/ 12 month minimum commitment."]
[null,null,"IRIS Telemetry Module only covers the price of the hardware. IRIS Telemetry requires an IRIS Telemetry Module and an IRIS Information Service Package."]
[]
[null,10,"Shipping Weights and Dimensions","Skid w/Carton"]
[]
[null,null,"Weight (w/ 240AH Battery)","1260 lbs / 572 Kg"]
[null,null,"Length","75\" / 1905 mm"]
[null,null,"Width","45\" / 1143 mm"]
[null,null,"Height","52\" / 1321 mm"]

{"sheet":"T1_T1B","index":6,"n_rows":175,"n_cols":14,"rows_kept":175,"cut":false,"hidden":false,"merged":[[0,2,0,3],[1,2,1,3],[2,2,2,3],[3,2,3,3],[73,3,73,4],[73,5,73,6],[74,3,74,4],[74,5,74,6],[75,3,75,4],[75,5,75,6],[76,3,76,4],[76,5,76,6],[77,3,77,4],[77,5,77,6],[78,3,78,4],[78,5,78,6],[81,4,81,8],[83,3,83,6],[85,3,85,4],[86,3,86,4],[88,3,88,4],[88,5,88,6],[88,7,88,8],[89,3,89,4],[89,5,89,6],[89,7,89,8],[90,3,90,4],[90,5,90,6],[90,7,90,8],[91,3,91,4],[91,5,91,6],[91,7,91,8],[92,3,92,4],[92,5,92,6],[92,7,92,8],[93,3,93,4],[93,5,93,6],[93,7,93,8],[94,3,94,4],[94,5,94,6],[94,7,94,8],[95,3,95,4],[95,5,95,6],[95,7,95,8],[96,3,96,4],[96,5,96,6],[96,7,96,8],[101,2,101,6],[120,4,120,6],[122,2,122,5],[123,2,123,5],[124,2,124,5],[125,2,125,5],[126,2,126,5],[128,2,128,5],[129,2,129,5],[130,2,130,5],[131,2,131,5],[132,2,132,5],[134,4,134,6],[138,2,138,4],[147,4,147,5]]}
["T1_T1B",null,{"$f":"Start_Here!$C$8","v":"Contact Name"}]
[null,null,{"$f":"Start_Here!$C$5","v":"Company Name"}]
[null,null,{"$f":"Start_Here!$C$6","v":"Address"}]
[null,null,{"$f":"Start_Here!$C$7","v":"City, State Zip"}]
[null,null,{"$f":"Start_Here!$C$39","v":"Rep Name"}]
[null,null,{"$f":"Start_Here!$C$35","v":"Tennant Sales and Service Company"}]
[null,null,{"$f":"Start_Here!$C$36","v":"701 North Lilac Drive"}]
[null,null,{"$f":"Start_Here!$C$38","v":"Minneapolis, MN 55440-1452"}]
[null,null,{"$f":"Start_Here!$C$41","v":"800-553-8033"},null,"Quote Date :",null,{"$f":"Letter!$A$25","v":"2014-10-02"}]
[]
[]
[null,null,"EXCLUSIVE FACTORY-DIRECT WARRANTY"]
[null,null,"10 YEARS - ROTOMOLDED PARTS"]
[null,null,"36 MONTHS OR 2500 HOURS - PARTS"]
[null,null,"36 MONTHS LABOR"]
[null,null,"90 DAYS – TRAVEL ON T1B, NO TRAVEL ON T1",null,"                Quote Request Information"]
[null,null,"BATTERIES AGM PRO-RATED 6 MONTHS",null,null,null,"Fax (quote only)"]
[null,null,"LITHIUM ION 24 MONTHS (Full Replacement)",null,null,null,"Mail (quote,lit, specs)"]
[null,null,null,null,null,null,"Fax + Mail"]
[]
[]
[null,null,"Description","Reference No.","Canada Price","Qty.","Extended Price"]
[null,null,null,null,null,"*"]
[null,null,"T1 Cord-Electric Cylindrical Scrubber",9004191,4342,null,{"$f":"F24*E24","v":0},null,null,null,null,{"$f":"SUM(F24)","v":0},"Surcharge Qty"]
[null,null,"15\" (380 mm) cleaning path.  Complete package includes removable, Hygenic® fully cleanable 3 gallon (11.4 liter) solution/ 4.5 gallon (17 liters) recovery tanks, Insta-AdjustTM handle, nylon brush, 50-ft (15-m) \"safety yellow\" power cord and multi-language operator manual.",null,null,{"$f":"SUM(F24)","v":0},null,null,null,null,null,0,"Surcharge Qty"]
[null,null,"Boxed Dimensions:  34\" L x 22\" W x 32\" H (864  mm x 559  mm x 813  mm).",null,null,{"$f":"SUM(F25)","v":0},null,null,null,null,null,0,"Surcharge Qty"]
[null,null,"Shipping Weight / Volume:   125 lb (57 kg) / 13.9 ft3 (.39 m3)",null,null,{"$f":"SUM(F26)","v":0},null,null,null,null,null,0,"Surcharge Qty"]
[null,null,null,null,null,{"$f":"SUM(F27)","v":0},null,null,null,null,null,0,"Surcharge Qty"]
[null,"Accessories for the T1 Scrubber",null,null,null,{"$f":"SUM(F30:F35)","v":0},null,null,null,null,null,0,"Surcharge Qty"]
[null,null,"15\" (380 mm) Nylon  ",1037197,186.5,null,{"$f":"F30*E30","v":0},null,null,null,null,0,"Surcharge Qty"]
[null,null,"15\" (380 mm) Polypropylene",1037277,214.9,null,0,null,null,null,null,0,"Surcharge Qty"]
[null,null,"15\" (380 mm) Abrasive Bristle  ",1037278,306.5,null,0,null,null,null,null,0,"Surcharge Qty"]
[null,null,"Outside (Front or Rear) Urethane Blade (requires 2)",1050943,51.7,null,0,null,null,null,null,0,"Surcharge Qty"]
[null,null,"Middle Urethane Blade (requires 2)",1057241,57.4,null,0,null,null,null,null,{"$f":"SUM(F34)","v":0},"Surcharge Qty"]
[null,null,"50-ft (15-m) \"Safety Yellow\" Power Cord",1042403,152.9,null,0,null,null,null,null,{"$f":"SUM(F35)","v":0},"Surcharge Qty"]
[null,null,null,null,null,null,null,null,null,null,null,{"$f":"SUM(F36)","v":0},"Surcharge Qty"]
[null,null,null,null,null,null,null,null,null,null,null,0,"Surcharge Qty"]
[null,null,"T1B Battery Cylindrical Scrubber  - 15\" cleaning path.  Complete package includes removable, Hygenic® fully cleanable 2.5 gallon (9.5liter) solution/ 3.4 gallon (12.9 liters) recovery tanks, Insta-AdjustTM handle, nylon brush, appropriate off board world charger with power cord and multi-language operator manual.",null,null,{"$f":"SUM(F42,F45)","v":0},null,null,null,null,null,0,"Surcharge Qty"]
[null,null,"Boxed Dimensions:  32\" L x 24\" W x 37\" H (813 mm x 610 mm x 940 mm). ",null,null,{"$f":"SUM(F38)","v":0},null,null,null,null,null,0,"Surcharge Qty"]
[null,null,"Shipping Weight (see battery options below)",null,null,{"$f":"SUM(F39)","v":0}]
[]
[null,null,"T1B Battery Cylindrical Scrubber (with AGM batteries)",9008635,5613,null,{"$f":"F42*E42","v":0}]
[null,null,"Shipping Weight: 158 lbs/ 72 kg",null,null,{"$f":"SUM(F42)","v":0}]
[]
[null,null,"T1B Battery Cylindrical Scrubber (with Li-ion batteries)",9008638,7240,null,{"$f":"F45*E45","v":0}]
[null,null,"Shipping Weight: 143 lbs/ 65 kg",null,null,{"$f":"SUM(F45)","v":0}]
[]
[null,"AFTERMARKET - Accessories for the T1 Battery Scrubber",null,null,null,{"$f":"SUM(F49:F59)","v":0}]
[null,null,"AGM Battery",1065086,279.20000000000005,null,{"$f":"F49*E49","v":0}]
[null,null,"Lithium Ion Battery",9008690,2768.7,null,0]
[null,null,"AGM Battery Charger",1067790,629.6,null,0]
[null,null,"Lithium Ion Battery Charger",1065754,721.2,null,0]
[null,null,"AGM to Lithium Ion Battery Kit (includes LI battery, charger and other conversion items)",9008723,2673.5,null,0]
[null,null,"Charger Power Cord (from charger to wall) , approx. 8 ft.  US Plug end",1044067,31.400000000000002,null,0]
[null,null,"15\" (380 mm) Nylon  ",1037197,186.5,null,0]
[null,null,"15\" (380 mm) Polypropylene",1037277,214.9,null,0]
[null,null,"15\" (380 mm) Abrasive Bristle  ",1037278,306.5,null,{"$f":"F57*E57","v":0}]
[null,null,"Outside (Front or Rear) Urethane Blade (requires 2)",1064751,58.4,null,{"$f":"F58*E58","v":0}]
[null,null,"Middle Urethane Blade (requires 2)",1049397,53.800000000000004,null,{"$f":"F59*E59","v":0}]
[]
[]
[null,"Custom Solution--write in description, qty, price, and PN if applicable",null,null,null,{"$f":"SUM(F63)","v":0}]
[null,null,null,null,"Insert Prices Here",{"$f":"SUM(F64:F67)","v":0}]
[null,null,null,"Custom",null,{"$f":"IF(E64 <> \"\", 1, 0)","v":0},{"$f":"F64*E64","v":0}]
[null,null,null,"Custom",null,{"$f":"IF(E65 <> \"\", 1, 0)","v":0},{"$f":"F65*E65","v":0}]
[null,null,null,"Custom",null,{"$f":"IF(E66 <> \"\", 1, 0)","v":0},{"$f":"F66*E66","v":0}]
[null,null,null,"Custom",null,{"$f":"IF(E67 <> \"\", 1, 0)","v":0},{"$f":"F67*E67","v":0}]
[null,null,"Prepaid and Add","Freight",null,1,{"$f":"F68*E68","v":0}]
[null,null,"Subject to all applicable taxes","Tax",null,1,{"$f":"F69*E69","v":0}]
[]
[null,null,null,"MACHINE TOTAL*",null,null,{"$f":"SUM(G24:G69)","v":0},null,null,null,null,null,null,"This goes to \"My Documents\""]
[null,null,null,null,null,null,{"$f":"SUM(G71)","v":0}]
[]
[null,null,"National Leasing - Leasing Calculation Option:","Finance Option 1",null,"Finance Option 2",null,null,{"$f":"Financing!A38","v":"Rates 2016 - Rev. 7/1/2016"}]
[null,null,"Purchase Option:",1,null,"FMV Scrubber",null,null,{"$f":"Financing!A39","v":"“Blank Payment Amounts Indicate The Financing Option Or Purchase Options Selected Are Not "}]
[null,null,"24 Months",0,null,0,null,null,{"$f":"Financing!A40","v":"Applicable Or The Machine Total Is Below The Minimum Amount For The Selected Vendor”"}]
[null,null,"36 Months",0,null,0,null,null,{"$f":"Financing!A41","v":"\"Quoted monthly payments are estimates only and are based on a certain level of credit rating."}]
[null,null,"48 Months",0,null,0,null,null,{"$f":"Financing!A42","v":"Actual monthly payments may be higher depending on your credit rating.\""}]
[null,null,"60 Months",0,null,0,null,null,{"$f":"Financing!A43","v":"“Financing rates do not include Pre-Paid Service”"}]
[null,"   TennantTrue",null,null,0,0]
[]
[null,null,"Is customer interested in service program?","Yes","*State/County selection required for TennantTrue service options"]
[]
[null,null,"If not, why?"]
[]
[null,null,"Term:",36,null,null,"AB Brushes","No"]
[null,null,"Monthly machine usage (hrs):",25]
[]
[null,null,"TennantTrue: ","Rate Per Unit",null,"Hourly Labor Rate",null,"Site Visit Charge"]
[null,null,"Gold - Monthly"]
[null,null,"Gold - Pre Pay Full Term"]
[null,null,"Silver - Monthly"]
[null,null,"Silver - Annually"]
[null,null,"Silver - Pre Pay Full Term"]
[null,null,"Silver - Per Visit"]
[null,null,"Pay As You Go",null,null,null,null,null,null,null,"*State/County selection required for 'Pay As You Go' and 'On Demand'."]
[null,null,"On Demand"]
[]
[]
[]
[null,null,"Quote Special Instructions:"]
[]
[]
[null,null,{"$f":"Start_Here!E33","v":"Terms and Conditions"}]
[null,null,{"$f":"Start_Here!E34","v":"Ask your local sales rep for estimated lead times. Verify when placing order"}]
[null,null,{"$f":"Start_Here!E35","v":"All orders subject to acceptance by Tennant Sales and Service Company, Minneapolis, Minnesota"}]
[null,null,{"$f":"Start_Here!E36","v":"Prices subject to change without notice. Subject to any applicable taxes."}]
[null,null,{"$f":"Start_Here!E37","v":"Terms:  Net 30 days.  Payable in Canadian Funds"}]
[null,null,{"$f":"Start_Here!E38","v":"Freight:  Accessories, parts, supplies, detergents, and floor coatings orders delivered DDP "}]
[null,null,{"$f":"Start_Here!E39","v":"shipping point Frt PPD.  Machine orders delivered DDP shipping point Frt PPD and add."}]
[null,null,{"$f":"Start_Here!E40","v":"Returned Merchandise is subject to a restocking fee."}]
[null,null,{"$f":"Start_Here!E42","v":"Printed General Terms and Conditions are also available upon request."}]
[null,null,{"$f":"Start_Here!E43","v":0}]
[]
[]
[null,null,null,null,"Quote Date :",null,{"$f":"Letter!$A$25","v":"2014-10-02"}]
["Order Placement Information:  To place your order, fill in PO# and customer signatures,"]
["call or fax to the numbers listed below. Customer Purchase Order is required."]
["If information is missing, orders will be entered and held until all information is received."]
[null,null,"Customer Number",null,{"$f":"Start_Here!F15","v":"Cust Grp 3"}]
[null,null,{"$f":"Start_Here!$F$5","v":0},null,{"$f":"Start_Here!F16","v":0}]
[null,null,{"$f":"Start_Here!$B$18","v":"Sold To Information (Please Verify)"}]
["Company",null,{"$f":"Start_Here!$C$19","v":""}]
["Address",null,{"$f":"Start_Here!$C$20","v":""}]
[null,null,{"$f":"Start_Here!$C$21","v":""}]
["Name",null,{"$f":"Start_Here!$C$22","v":""}]
["Phone",null,{"$f":"Start_Here!$C$23","v":""}]
[null,null,{"$f":"Start_Here!$B$11","v":"Ship To Information (Please Verify)"}]
["Company",null,{"$f":"Start_Here!$C$12","v":""}]
["Address",null,{"$f":"Start_Here!$C$13","v":""}]
[null,null,{"$f":"Start_Here!$C$14","v":""}]
["Name",null,{"$f":"Start_Here!$C$15","v":""}]
["Phone",null,{"$f":"Start_Here!$C$16","v":""}]
[null,null,{"$f":"Start_Here!$B$25","v":"Shipping/Carrier Instructions:"},null,"Order Special Instructions:"]
[null,null,{"$f":"Start_Here!$C$26","v":0}]
[]
[null,null," Customer Purchase Order No. "]
[null,null," (please attach copy) "]
[]
[]
[null,null," Tax Exempt ",null," Yes "]
[null,null,null,null," No "]
[null,null," If Yes, attach a copy of your exemption certificate. "]
[]
[null,null," Requested Delivery Date "]
[null,null,{"$f":"Start_Here!$F$14","v":0}]
[]
[null,null,{"$f":"Start_Here!$F$8","v":0},null,{"$f":"Start_Here!$F$11","v":0}]
[null,null," Authorized Buyer (please print) ",null," Phone Number "]
[]
[null,null," Authorized Buyer Signature "]
[]
[null,null,"Tennant Representative"]
[]
["Specialized Maintenance Equipment"]
[{"$f":"Start_Here!$C$45","v":"TENNANT · 701 NORTH LILAC DRIVE · P.O. BOX 1452 · MINNEAPOLIS, MN 55440-1452 ·"}]
[{"$f":"Start_Here!$C$46","v":" PHONE:800-553-8033 · FAX:763-513-2116"}]
[]
[null,"Special Information "]
[]
[]
[null,"1","Pre-Configured Machines cannot add or change options.  All units are packaged on a Skid w/Carton and will ship via LTL Carrier."]
[null,null,"When ordering, provide the reference number listed above.  Price does not include freight or tax.  Availability of units "]
[null,null,"and lead time may vary."]
[]
[null,"2","One pad driver comes standard with a T2."]
[]
[null,3,"Skid w/Carton, Stackable is the default packaging method and will be added to the configuration unless otherwise specified."]
[]
[null,4,"Machine Weights and dimensions","Skid w/Carton"]
[]
[null,null,"Weight (w/105AH battery)","331 lbs / 150 Kg"]
[null,null,"Length","47\" / 1200mm"]
[null,null,"Width","30\" / 750mm"]
[null,null,"Height","45\" / 1150mm"]

{"sheet":"T2","index":7,"n_rows":224,"n_cols":14,"rows_kept":224,"cut":false,"hidden":false,"merged":[[198,4,198,5],[174,2,174,5],[175,2,175,5],[176,2,176,5],[177,2,177,5],[179,2,179,5],[180,2,180,5],[181,2,181,5],[182,2,182,5],[183,2,183,5],[185,4,185,6],[189,2,189,4],[147,7,147,8],[152,2,152,6],[171,4,171,6],[173,2,173,5],[145,3,145,4],[145,5,145,6],[145,7,145,8],[146,3,146,4],[146,5,146,6],[146,7,146,8],[147,3,147,4],[147,5,147,6],[143,7,143,8],[144,3,144,4],[144,5,144,6],[144,7,144,8],[141,3,141,4],[141,5,141,6],[141,7,141,8],[142,3,142,4],[142,5,142,6],[142,7,142,8],[143,3,143,4],[143,5,143,6],[136,3,136,4],[139,3,139,4],[139,5,139,6],[139,7,139,8],[140,3,140,4],[140,5,140,6],[140,7,140,8],[137,3,137,4],[134,3,134,6],[124,3,124,4],[124,5,124,6],[125,3,125,4],[125,5,125,6],[126,3,126,4],[126,5,126,6],[127,3,127,4],[127,5,127,6],[128,3,128,4],[128,5,128,6],[129,3,129,4],[129,5,129,6],[132,4,132,8],[30,2,30,6],[31,2,31,6],[47,2,47,3],[0,2,0,3],[1,2,1,3],[2,2,2,3],[3,2,3,3],[11,2,11,6],[29,2,29,6]]}
["T2",null,{"$f":"Start_Here!$C$8","v":"Contact Name"}]
[null,null,{"$f":"Start_Here!$C$5","v":"Company Name"}]
[null,null,{"$f":"Start_Here!$C$6","v":"Address"}]
[null,null,{"$f":"Start_Here!$C$7","v":"City, State Zip"}]
[null,null,{"$f":"Start_Here!$C$39","v":"Rep Name"}]
[null,null,{"$f":"Start_Here!$C$35","v":"Tennant Sales and Service Company"}]
[null,null,{"$f":"Start_Here!$C$36","v":"701 North Lilac Drive"}]
[null,null,{"$f":"Start_Here!$C$38","v":"Minneapolis, MN 55440-1452"}]
[null,null,{"$f":"Start_Here!$C$41","v":"800-553-8033"},null,"Quote Date :",null,{"$f":"Letter!$A$25","v":"2014-10-02"}]
[]
[]
[null,null,"BUILT-IN “TENNANT VALUE” INCLUDES:"]
[]
[null,null,"26 l/6.9 gal Solution Tank  & 36 l/9.5 gal Recovery Tank",null,"Standard (2) 12V 105 AH Batteries "]
[null,null,"Rugged DuramerTM Tank Construction",null,"Battery Tray"]
[null,null,"Hygienic Recovery Tank",null,"On-board Charger"]
[null,null,"10 l/2.6 gal Demisting Chamber to Protect Vac Fan ",null,"Recovery Tank Debris Tray"]
[null,null,"Adjustable Solution Flow",null,"Unsurpassed Ergonomic Design"]
[null,null,"Extremely Low Noise Level  (≤68 dBa)",null,"Adjustable Console Height"]
[null,null,"Pad Assist - less than 2 kg/4.5 lbs of push force requried",null,"Trigger Design"]
[null,null,".75 kW/1 HP brush motor, 230 RPM",null,"Front Bucket Fill Port"]
[null,null,"Cast Aluminum Scrub Deck",null,"On-board Pad Driver Hang"]
[null,null,"Cast Aluminum Squeegee Frame",null,"Gray Solid Urethane Tires"]
[null,null,"Breakaway Squeegee Design",null,"Automotive Triple-Sealed Electrical Connectors"]
[null,null,"Factory Set Squeegee Assembly for Maximium Recovery",null,"10cm /4\" Edge & Reach Under Cleaning"]
[null,null,"100% Recovery in 180º Point Turns",null,"Key Switch for Safety"]
[null,null,"Urethane Squeegee Blades",null,"No Tool Brush / Squegee Change"]
[null,null,"Squegee Hang",null,"Includes Pad Driver"]
[]
[null,null,"TENNANT COMPANY WARRANTY"]
[null,null,"3 YEARS OR 2500 HOURS ON ALL COMPONENTS, 3 YEARS LABOR"]
[null,null,"90 DAYS TRAVEL, 10 YEARS ON DURAMERTM TANKS"]
[]
[]
[]
[null,null,null,null,"                Quote Request Information"]
[null,null,null,null,null,null,"Fax (quote only)"]
[null,null,null,null,null,null,"Mail (quote,lit, specs)"]
[null,null,null,null,null,null,"Fax + Mail"]
[]
[]
[null,null,"Description","Reference No.","Canada Price","Qty.","Extended Price"]
[null,"Pre-Configured Machines (Note 1)",null,null,null,{"$f":"SUM(F44)","v":0}]
[null,null,"T2 Walk-Behind Scrubber  430 mm/17\" - Conventional w/105AH Battery","MV-T2-0001",7502,null,{"$f":"F44*E44","v":0},null,null,null,null,{"$f":"SUM(F44)","v":0},"Surcharge Qty"]
[null,null,null,null,null,{"$f":"SUM(F44)","v":0},null,null,null,null,null,0,"Surcharge Qty"]
[null,null,"Model includes 105AH Battery, On-Board Charger, and Pad Driver",null,null,{"$f":"SUM(F45)","v":0},null,null,null,null,null,0,"Surcharge Qty"]
[null,null,null,null,null,{"$f":"SUM(F46)","v":0},null,null,null,null,null,0,"Surcharge Qty"]
[null,null,"All Pre-Configured Machines are packaged in a Skid w/Carton for shipment via LTL carriers.  No additional options can be added or changed.",null,null,{"$f":"SUM(F47)","v":0},null,null,null,null,null,0,"Surcharge Qty"]
[null,null,null,null,null,null,null,null,null,null,null,0,"Surcharge Qty"]
[null,null,null,null,null,null,null,null,null,null,null,0,"Surcharge Qty"]
[null,"Base Configuration",null,"Reference Number","Price",{"$f":"SUM(F52,F55,F60)","v":0},null,null,null,null,null,0,"Surcharge Qty"]
[null,null,"Cleaning Type",null,null,{"$f":"SUM(F53)","v":0},null,null,null,null,null,0,"Surcharge Qty"]
[null,null,"T2 Walk-Behind Scrubber  430 mm/17\" - Disk","T2-430-D",7502,null,{"$f":"F53*E53","v":0},null,null,null,null,0,"Surcharge Qty"]
[null,null,null,null,null,null,null,null,null,null,null,{"$f":"SUM(F54)","v":0},"Surcharge Qty"]
[null,null,"Battery Type",null,null,{"$f":"SUM(F56:F58)","v":0},null,null,null,null,null,{"$f":"SUM(F55)","v":0},"Surcharge Qty"]
[null,null,"Wet 105AH C/20  (Kit of 2 batteries)",1030291,"N/C",null,{"$f":"IF(F56=0,\" \",\"N/C\")","v":" "},null,null,null,null,{"$f":"SUM(F56)","v":0},"Surcharge Qty"]
[null,null,"Sealed/MF Gel 102AH C/20  (Kit of 2 batteries)",1071125,318,null,{"$f":"F57*E57","v":0},null,null,null,null,0,"Surcharge Qty"]
[null,null,"Without Battery",null,-568,null,{"$f":"F58*E58","v":0},null,null,null,null,0,"Surcharge Qty"]
[null,null,null,null,null,null,null,null,null,null,null,0,"Surcharge Qty"]
[null,null,"Charger","Reference Number",null,{"$f":"SUM(F61:F62)","v":0}]
[null,null,"9A 100-240V AC 50/60Hz 1 Ph - on board",1066718,"N/C",null,{"$f":"IF(F61=0,\" \",\"N/C\")","v":" "}]
[null,null,"11A 100-240V AC 50/60Hz 1Ph - off board",1073638,"N/C",null,{"$f":"IF(F62=0,\" \",\"N/C\")","v":" "}]
[]
[null,"Pad Driver and Pads (Note 2)",null,"Reference Number",null,{"$f":"SUM(F65)","v":0}]
[null,null,"430mm/17\" Disk Pad Driver/Pads (1 Required)",null,null,{"$f":"SUM(F66:F73)","v":0}]
[null,null,"Pad Driver",1016813,"N/C",null,{"$f":"IF(F66=0,\" \",\"N/C\")","v":" "}]
[null,null,"Pads ",null,null,{"$f":"SUM(F68:F73)","v":0}]
[null,null,"Brown Stripping - 3M",1050267,19.600000000000001,null,{"$f":"F68*E68","v":0}]
[null,null,"Blue Scrubbing - 3M",1050270,19.600000000000001,null,0]
[null,null,"Red Cleaning - 3M",1050271,19.600000000000001,null,0]
[null,null,"White Polishing - 3M",1050273,19.600000000000001,null,0]
[null,null,"Black Stripping-Hi Pro - 3M",1050262,27.6,null,0]
[null,null,"Maroon Surface Prep - 3M",1051028,26.8,null,0]
[]
[null,"Support",null,"Reference Number",null,{"$f":"SUM(F76:F80)","v":0}]
[null,null,"T2 Operator Manual (English/Spanish/French)",9008844,"N/C",null,{"$f":"IF(F76=0,\" \",\"N/C\")","v":" "}]
[null,null,"Additional Operator Manual","see above",55,null,{"$f":"F77*E77","v":0}]
[null,null,"T2 Parts Manual",9008845,14,null,{"$f":"F78*E78","v":0}]
[]
[null,null,"Packaging",null,null,{"$f":"SUM(F81:F81)","v":0}]
[null,null,"Skid w/Carton, Stackable ",9011196,"N/C",null,{"$f":"IF(F81=0,\" \",\"N/C\")","v":" "}]
[]
[null,"AFTERMARKET ITEMS (ordered separately) :",null,null,null,{"$f":"SUM(F85,F99)","v":0}]
[]
[null,"Brushes and Pads (Replacements)",null,"Reference Number",null,{"$f":"SUM(F86:F97)","v":0}]
[null,null,"Polypropylene",1016765,214.2,null,{"$f":"F86*E86","v":0}]
[null,null,"Nylon  ",1016764,264.60000000000002,null,{"$f":"F87*E87","v":0}]
[null,null,"Abrasive Bristle",1016763,354.2,null,{"$f":"F88*E88","v":0}]
[]
[null,null,"Pad Driver",1016813,301.7,null,{"$f":"F90*E90","v":0}]
[null,null,"Pads",null,null,{"$f":"SUM(F92:F97)","v":0}]
[null,null,"White Polishing - 3M ",1050273,19.600000000000001,null,{"$f":"F92*E92","v":0}]
[null,null,"Red Cleaning - 3M",1050271,19.600000000000001,null,0]
[null,null,"Blue Scrubbing - 3M",1050270,19.600000000000001,null,0]
[null,null,"Brown Stripping- 3M",1050267,19.600000000000001,null,0]
[null,null,"Black Stripping - HiPro - 3M",1050262,27.6,null,0]
[null,null,"Maroon Surface Prep - 3M  (for Chemical Free Stripping)",1051028,26.8,null,0]
[]
[null,"Maintenance Items",null,"Reference Number","Price",{"$f":"SUM(F100:F110)","v":0}]
[null,null,"9A 100-240V AC 50/60Hz 1Ph - On Board charger",9008724,550.9,null,{"$f":"F100*E100","v":0}]
[null,null,"11A 100-240V AC 50/60Hz 1Ph - Off Board Charger",1073638,599.9,null,0]
[null,null,"Squeegee Blade Front, Urethane - Standard",1045381,41.800000000000004,null,0]
[null,null,"Squeegee Blade Rear, Urethane - Standard",1045384,51.6,null,0]
[null,null,"Squeegee Blade Front, Gum Rubber",1045380,18.2,null,0]
[null,null,"Squeegee Blade Rear, Gum Rubber",1045383,29.4,null,0]
[null,null,"Squeegee Blade Front, Linatex",1040983,23.400000000000002,null,0]
[null,null,"Squeegee Blade Rear, Linatex",1040626,33.4,null,0]
[null,null,"Kit, Parking Brake",9004855,289.70000000000005,null,0]
[null,null,"Battery,  Wet 105AH, 12V (Requires 2)",578426,283.8,null,0]
[null,null,"Battery, Sealed/MF Gel, 100AH, 12V (Requires 2)",1071125,726.5,null,0]
[]
[]
[null,"Custom Solution--write in description, qty, price, and PN if applicable",null,null,null,{"$f":"SUM(F114)","v":0}]
[null,null,null,null,"Insert Prices Here",{"$f":"SUM(F115:F118)","v":0}]
[null,null,null,"Custom",null,{"$f":"IF(E115 <> \"\", 1, 0)","v":0},{"$f":"F115*E115","v":0}]
[null,null,null,"Custom",null,{"$f":"IF(E116 <> \"\", 1, 0)","v":0},{"$f":"F116*E116","v":0}]
[null,null,null,"Custom",null,{"$f":"IF(E117 <> \"\", 1, 0)","v":0},{"$f":"F117*E117","v":0}]
[null,null,null,"Custom",null,{"$f":"IF(E118 <> \"\", 1, 0)","v":0},{"$f":"F118*E118","v":0}]
[null,null,"Prepaid and Add","Freight",null,1,{"$f":"F119*E119","v":0}]
[null,null,"Subject to all applicable taxes","Tax",null,1,{"$f":"F120*E120","v":0}]
[]
[null,null,null,"MACHINE TOTAL*",null,null,{"$f":"SUM(G44:G120)","v":0},null,null,null,null,null,null,"This goes to \"My Documents\""]
[null,null,null,null,null,null,{"$f":"SUM(G122)","v":0}]
[]
[null,null,"National Leasing - Leasing Calculation Option:","Finance Option 1",null,"Finance Option 2",null,null,{"$f":"Financing!A38","v":"Rates 2016 - Rev. 7/1/2016"}]
[null,null,"Purchase Option:",1,null,"FMV Scrubber",null,null,{"$f":"Financing!A39","v":"“Blank Payment Amounts Indicate The Financing Option Or Purchase Options Selected Are Not "}]
[null,null,"24 Months",0,null,0,null,null,{"$f":"Financing!A40","v":"Applicable Or The Machine Total Is Below The Minimum Amount For The Selected Vendor”"}]
[null,null,"36 Months",0,null,0,null,null,{"$f":"Financing!A41","v":"\"Quoted monthly payments are estimates only and are based on a certain level of credit rating."}]
[null,null,"48 Months",0,null,0,null,null,{"$f":"Financing!A42","v":"Actual monthly payments may be higher depending on your credit rating.\""}]
[null,null,"60 Months",0,null,0,null,null,{"$f":"Financing!A43","v":"“Financing rates do not include Pre-Paid Service”"}]
[null,"   TennantTrue",null,null,0,0]
[]
[null,null,"Is customer interested in service program?","Yes","*State/County selection required for TennantTrue service options"]
[]
[null,null,"If not, why?"]
[]
[null,null,"Term:",36,null,null,"AB Brushes","No"]
[null,null,"Monthly machine usage (hrs):",25]
[]
[null,null,"TennantTrue: ","Rate Per Unit",null,"Hourly Labor Rate",null,"Site Visit Charge"]
[null,null,"Gold - Monthly",70]
[null,null,"Gold - Pre Pay Full Term",2344]
[null,null,"Silver - Monthly",50]
[null,null,"Silver - Annually",592]
[null,null,"Silver - Pre Pay Full Term",1737]
[null,null,"Silver - Per Visit",310]
[null,null,"Pay As You Go",null,null,null,null,null,null,null,"*State/County selection required for 'Pay As You Go' and 'On Demand'."]
[null,null,"On Demand"]
[]
[]
[]
[null,null,"Quote Special Instructions:"]
[]
[]
[null,null,{"$f":"Start_Here!E33","v":"Terms and Conditions"}]
[null,null,{"$f":"Start_Here!E34","v":"Ask your local sales rep for estimated lead times. Verify when placing order"}]
[null,null,{"$f":"Start_Here!E35","v":"All orders subject to acceptance by Tennant Sales and Service Company, Minneapolis, Minnesota"}]
[null,null,{"$f":"Start_Here!E36","v":"Prices subject to change without notice. Subject to any applicable taxes."}]
[null,null,{"$f":"Start_Here!E37","v":"Terms:  Net 30 days.  Payable in Canadian Funds"}]
[null,null,{"$f":"Start_Here!E38","v":"Freight:  Accessories, parts, supplies, detergents, and floor coatings orders delivered DDP "}]
[null,null,{"$f":"Start_Here!E39","v":"shipping point Frt PPD.  Machine orders delivered DDP shipping point Frt PPD and add."}]
[null,null,{"$f":"Start_Here!E40","v":"Returned Merchandise is subject to a restocking fee."}]
[null,null,{"$f":"Start_Here!E42","v":"Printed General Terms and Conditions are also available upon request."}]
[null,null,{"$f":"Start_Here!E43","v":0}]
[]
[]
[null,null,null,null,"Quote Date :",null,{"$f":"Letter!$A$25","v":"2014-10-02"}]
["Order Placement Information:  To place your order, fill in PO# and customer signatures,"]
["call or fax to the numbers listed below. Customer Purchase Order is required."]
["If information is missing, orders will be entered and held until all information is received."]
[null,null,"Customer Number",null,{"$f":"Start_Here!F15","v":"Cust Grp 3"}]
[null,null,{"$f":"Start_Here!$F$5","v":0},null,{"$f":"Start_Here!F16","v":0}]
[null,null,{"$f":"Start_Here!$B$18","v":"Sold To Information (Please Verify)"}]
["Company",null,{"$f":"Start_Here!$C$19","v":""}]
["Address",null,{"$f":"Start_Here!$C$20","v":""}]
[null,null,{"$f":"Start_Here!$C$21","v":""}]
["Name",null,{"$f":"Start_Here!$C$22","v":""}]
["Phone",null,{"$f":"Start_Here!$C$23","v":""}]
[null,null,{"$f":"Start_Here!$B$11","v":"Ship To Information (Please Verify)"}]
["Company",null,{"$f":"Start_Here!$C$12","v":""}]
["Address",null,{"$f":"Start_Here!$C$13","v":""}]
[null,null,{"$f":"Start_Here!$C$14","v":""}]
["Name",null,{"$f":"Start_Here!$C$15","v":""}]
["Phone",null,{"$f":"Start_Here!$C$16","v":""}]
[null,null,{"$f":"Start_Here!$B$25","v":"Shipping/Carrier Instructions:"},null,"Order Special Instructions:"]
[null,null,{"$f":"Start_Here!$C$26","v":0}]
[]
[null,null," Customer Purchase Order No. "]
[null,null," (please attach copy) "]
[]
[]
[null,null," Tax Exempt ",null," Yes "]
[null,null,null,null," No "]
[null,null," If Yes, attach a copy of your exemption certificate. "]
[]
[null,null," Requested Delivery Date "]
[null,null,{"$f":"Start_Here!$F$14","v":0}]
[]
[null,null,{"$f":"Start_Here!$F$8","v":0},null,{"$f":"Start_Here!$F$11","v":0}]
[null,null," Authorized Buyer (please print) ",null," Phone Number "]
[]
[null,null," Authorized Buyer Signature "]
[]
[null,null,"Tennant Representative"]
[]
["Specialized Maintenance Equipment"]
[{"$f":"Start_Here!$C$45","v":"TENNANT · 701 NORTH LILAC DRIVE · P.O. BOX 1452 · MINNEAPOLIS, MN 55440-1452 ·"}]
[{"$f":"Start_Here!$C$46","v":" PHONE:800-553-8033 · FAX:763-513-2116"}]
[]
[null,"Special Information "]
[]
[]
[null,"1","Pre-Configured Machines cannot add or change options.  All units are packaged on a Skid w/Carton and will ship via LTL Carrier."]
[null,null,"When ordering, provide the reference number listed above.  Price does not include freight or tax.  Availability of units "]
[null,null,"and lead time may vary."]
[]
[null,"2","One pad driver comes standard with a T2."]
[]
[null,3,"Machine Weights and dimensions","Skid w/Carton"]
[]
[null,null,"Weight (w/105AH battery)","331 lbs / 150 Kg"]
[null,null,"Length","47\" / 1200mm"]
[null,null,"Width","30\" / 750mm"]
[null,null,"Height","45\" / 1150mm"]

{"sheet":"T300","index":8,"n_rows":438,"n_cols":14,"rows_kept":438,"cut":false,"hidden":false,"merged":[[60,0,60,1],[61,0,61,1],[334,4,334,6],[336,2,336,5],[348,4,348,6],[339,2,339,5],[310,5,310,6],[307,3,307,4],[307,5,307,6],[303,3,303,4],[303,5,303,6],[288,5,288,6],[289,3,289,4],[289,5,289,6],[290,3,290,4],[290,5,290,6],[352,2,352,4],[360,4,360,5],[340,2,340,5],[342,2,342,5],[343,2,343,5],[345,2,345,5],[346,2,346,5],[310,7,310,8],[44,2,44,6],[344,2,344,5],[309,5,309,6],[309,7,309,8],[310,3,310,4],[306,3,306,4],[306,5,306,6],[306,7,306,8],[315,1,315,6],[308,3,308,4],[308,5,308,6],[308,7,308,8],[337,2,337,5],[338,2,338,5],[309,3,309,4],[307,7,307,8],[304,3,304,4],[304,5,304,6],[304,7,304,8],[305,3,305,4],[305,5,305,6],[305,7,305,8],[303,7,303,8],[291,3,291,4],[291,5,291,6],[292,3,292,4],[292,5,292,6],[295,4,295,8],[297,3,297,6],[299,3,299,4],[300,3,300,4],[302,3,302,4],[302,5,302,6],[302,7,302,8],[15,2,15,3],[20,2,20,3],[21,2,21,3],[288,3,288,4],[287,3,287,4],[22,2,22,3],[408,4,409,4],[415,4,416,4],[0,2,0,3],[1,2,1,3],[2,2,2,3],[3,2,3,3],[11,2,11,6],[287,5,287,6],[39,2,39,6],[40,2,40,6],[41,2,41,6],[79,2,79,4],[80,2,80,4],[82,2,82,4],[42,2,42,6],[43,2,43,6]]}
["T300",null,{"$f":"Start_Here!$C$8","v":"Contact Name"}]
[null,null,{"$f":"Start_Here!$C$5","v":"Company Name"}]
[null,null,{"$f":"Start_Here!$C$6","v":"Address"}]
[null,null,{"$f":"Start_Here!$C$7","v":"City, State Zip"}]
[null,null,{"$f":"Start_Here!$C$39","v":"Rep Name"}]
[null,null,{"$f":"Start_Here!$C$35","v":"Tennant Sales and Service Company"}]
[null,null,{"$f":"Start_Here!$C$36","v":"701 North Lilac Drive"}]
[null,null,{"$f":"Start_Here!$C$38","v":"Minneapolis, MN 55440-1452"}]
[null,null,{"$f":"Start_Here!$C$41","v":"800-553-8033"},null,"Quote Date :",null,{"$f":"Letter!$A$25","v":"2014-10-02"}]
[]
[]
[null,null,"BUILT-IN “TENNANT VALUE” INCLUDES:"]
[]
[null,null,"42L/11 gal Solution Tank  & 53 L/14 gal Recovery Tank",null,"Emergency Stop  (standard on all drive units)"]
[null,null,"Rugged DuramerTM Rotomold Tank Construction",null,"Free Floating Head Skirt (disk machines)"]
[null,null,"Insta-ClickTM Pad Driver and Brush Attachment (Disk machines)",null,"Yellow Debris Hopper (cylindrical machines)"]
[null,null,"HygienicTM Recovery Tank",null,"Front Water Fill Port w/ Hose Hook"]
[null,null,"Multiple Setting Down Pressure",null,"Integrated Heat Sync for Electronics Protection"]
[null,null,"Adjustable Solution Flow",null,"Sealed Electrical Connectors"]
[null,null,"Variable Speed Control Bail",null,"Anti-Static Straps"]
[null,null,"MembraneTM Control Panel",null,"0.75 kW/1 HP brush motor, 230 RPM (disk)"]
[null,null,"Pro-MembraneTM Control Panel with Multiple Zone Settings™ Capability",null,"0.75 kW/1 HP brush motor, 1000 RPM (cylindrical)"]
[null,null,"Pro-PanelTM Controls with Full Color LCD Touch Screen (Option)",null,"0.45 kW/0.6 HP brush motor, 2200 RPM (orbital)"]
[null,null,"Supervisor QA ControlsTM settings (Lock Out Features)",null,"Recovery Tank Debris Tray with Deflector"]
[null,null,"On Board Diagnostics",null,"Unsurpassed Ergonomic Design"]
[null,null,"Extremely Low Noise Level  (≤65 dBa)",null,"Gray Non-Marking Tires"]
[null,null,"Quiet-Mode™ Standard",null,"10cm /4\" Edge & Reach Under Cleaning"]
[null,null,"Wet 105AH, Wet 130AH, and Wet 150AH Battery options available.",null,"Key Switch for Safety"]
[null,null,"Quick Release Battery Harness",null,"Hour Meter"]
[null,null,"Battery Tray",null,"Operators manual"]
[null,null,"On-board Charger with 3m/15 ft power cord",null,"Jacking Points/Shipping Tie Downs"]
[null,null,"Closed Machine Venting for Battery Charging",null,"Yellow Maintenance Touch Points"]
[null,null,"Cast Aluminum Squeegee Frame",null,"Integrated Accessory Rails w/Squegee & Bag Hang "]
[null,null,"Breakaway Squeegee Design w/ Integrated P-Trap",null,"Composite Scrub Deck (Single Disk)"]
[null,null,"Factory Set Squeegee Assembly for Maximium Recovery",null,"Cast Aluminum Scrub Deck (Dual Disk & Cylindrical)"]
[null,null,"Linatex Squeegee Blades with Tool-less Replacement",null,"11 Gauge Steel Scrub Deck (Orbital Only)"]
[]
[]
[]
[null,null,"TENNANT COMPANY WARRANTY"]
[null,null,"3 YEARS OR 2000 HOURS - PARTS"]
[null,null,"1 YEAR - BATTERY CHARGERS"]
[null,null,"2 YEARS - LABOR"]
[null,null,"6 MONTHS - TRAVEL"]
[null,null,"10 YEARS ON DURAMERTM ROTOMOLD TANKS"]
[]
[null,null,null,null,"                Quote Request Information"]
[null,null,null,null,null,null,"Fax (quote only)"]
[null,null,null,null,null,null,"Mail (quote,lit, specs)"]
[null,null,null,null,null,null,"Fax + Mail"]
[null,null,null,null,"                Primary Use"]
[null,null,null,null,null,null,"Inside"]
[null,null,null,null,null,null,"Outside"]
[]
[null,null,"Description","Reference #","Price Each","Qty","Extended Price"]
[null,"Pre-Configured Machines (Note 1)",null,null,"CANADA",{"$f":"SUM(F57:F71,F73,F76)","v":0}]
[null,null,"T300 Walk-Behind Scrubber - Disk",null,null,{"$f":"SUM(F58:F71)","v":0}]
[null,null,"430mm / 17\" Disk, Membrane Panel, Pad Assist, Conventional Scrubbing, 105AH Battery, On-Board Charger","MV-T300-0001",7797,null,{"$f":"F58*E58","v":0},null,null,null,null,{"$f":"SUM(F58)","v":0},"Surcharge Qty"]
[null,null,"430mm / 17\" Disk, Pro-Panel, Self Propel, ec-H2O NanoClean, 130AH Battery, On-Board Charger","MV-T300-0002",12270,null,{"$f":"F59*E59","v":0},null,null,null,null,{"$f":"SUM(F59)","v":0},"Surcharge Qty"]
[null,null,"430mm / 17\" Disk, Membrane Panel, Self Propel, ec-H2O NanoClean, Severe Environment Switch, Quiet Mode, 130AH Battery, On-Board Charger","MV-T300-0063",12109,null,0]
[null,null,"500mm / 20\" Disk, Membrane Panel, Pad Assist, Conventional Scrubbing, 130AH Battery, On-Board Charger, Quiet Mode","MV-T300-0081",8882,null,0]
[null,null,"500mm / 20\" Disk, Membrane Panel, Self Propel, ec-H2O NanoClean, 150AH Battery, On-Board Charger, Quiet Mode","MV-T300-0082",12545,null,0]
[null,null,"500mm / 20\" Disk, Membrane Panel, Pad Assist, Conventional Scrubbing, 130AH Battery, On-Board Charger","MV-T300-0003",8881,null,0,null,null,null,null,0,"Surcharge Qty"]
[null,null,"500mm / 20\" Disk, Membrane Panel, Self Propel, Conventional Scrubbing, 150AH Battery, On-Board Charger","MV-T300-0004",10426,null,0,null,null,null,null,0,"Surcharge Qty"]
[null,null,"500mm / 20\" Disk, Membrane Panel, Self Propel, ec-H2O NanoClean, 150AH Battery, On-Board Charger","MV-T300-0005",12432,null,0,null,null,null,null,0,"Surcharge Qty"]
[null,null,"500mm / 20\" Disk, Membrane Panel, Self Propel, ec-H2O NanoClean, Severe Environment Switch, Quiet Mode, 150AH Battery, On-Board Charger","MV-T300-0064",13244,null,0]
[null,null,"500mm / 20\" Disk, Pro-Panel, Self Propel, Conventional Scrubbing, 150AH Battery, On-Board Charger","MV-T300-0006",11287,null,0,null,null,null,null,0,"Surcharge Qty"]
[null,null,"500mm / 20\" Disk, Pro-Panel, Self Propel, ec-H2O NanoClean, 150AH Battery, On-Board Charger","MV-T300-0007",13404,null,0,null,null,null,null,0,"Surcharge Qty"]
[null,null,"600mm / 24\" Disk, Membrane Panel, Self Propel, Conventional Scrubbing, 150AH Battery, On-Board Charger","MV-T300-0008",11812,null,0,null,null,null,null,0,"Surcharge Qty"]
[null,null,"600mm / 24\" Disk, Pro-Panel, Self Propel, ec-H2O NanoClean, 150AH Battery, On-Board Charger","MV-T300-0009",14790,null,0,null,null,null,null,{"$f":"SUM(F70)","v":0},"Surcharge Qty"]
[null,null,"600mm / 24\" Disk, Membrane Panel, Self Propel, ec-H2O NanoClean, Severe Environment Switch, Quiet Mode, 150AH Battery, On-Board Charger","MV-T300-0065",14629,null,{"$f":"F71*E71","v":0}]
[]
[null,null,"T300 Walk-Behind Scrubber - Dual Cylindrical",null,null,{"$f":"SUM(F74)","v":0}]
[null,null,"500mm / 20\" Cylindrical, Membrane Panel, Self Propel, ec-H2O NanoClean, 150AH Battery, On-Board Charger","MV-T300-0012",14769,null,{"$f":"F74*E74","v":0}]
[]
[null,null,"T300 Walk-Behind Scrubber - Orbital",null,null,{"$f":"SUM(F77:F78)","v":0}]
[null,null,"500mm / 20\" Orbital, Membrane Panel, Self Propel, 150AH Battery, On-Board Charger","MV-T300-0010",11073,null,{"$f":"F77*E77","v":0}]
[null,null,"500mm / 20\" Orbital, Membrane Panel, ec-H2O NanoClean, Self Propel, 150AH Battery, On-Board Charger","MV-T300-0011",13081,null,{"$f":"F78*E78","v":0}]
[]
[null,null,"All units above include Standard Battery and On-Board Charger unless otherwise stated.",null,null,{"$f":"SUM(F58:F78)","v":0}]
[null,null,"All pre-configured disk machines include pad drivers and dual cylindrical machines included two nylon brushes.",null,null,{"$f":"SUM(F59:F79)","v":0}]
[null,null,null,null,null,{"$f":"SUM(F63:F80)","v":0}]
[null,null,"All Pre-Configured Machines are packaged in a Skid w/Carton for shipment via LTL carriers.  No additional options can be added or changed.",null,null,{"$f":"SUM(F64:F81)","v":0}]
[]
[null,"Base Configuration",null,null,"Canada Price",{"$f":"SUM(F86,F93,F97,F100,F104,F114)","v":0}]
[null,null,"Cleaning Type",null,null,{"$f":"SUM(F87:F91)","v":0}]
[null,null,"T300 Walk-Behind Scrubber  430 mm/17\" - Disk","T300-430-D",6927,null,{"$f":"F87*E87","v":0}]
[null,null,"T300 Walk-Behind Scrubber  500 mm/20\" - Disk","T300-500-D",7923,null,{"$f":"F88*E88","v":0}]
[null,null,"T300 Walk-Behind Scrubber  600 mm/24\" - Dual Disk, Self Propel","T300-600-D",10642,null,{"$f":"F89*E89","v":0}]
[null,null,"T300 Walk-Behind Scrubber  500 mm/20\" - Dual Cylindrical, Self Propel","T300-500-C",11490,null,{"$f":"F90*E90","v":0}]
[null,null,"T300 Walk-Behind Scrubber  500 mm/20\" - Orbital, Self Propel","T300-500-O",10308,null,{"$f":"F91*E91","v":0}]
[]
[null,null,"Trim Level",null,"Price",{"$f":"SUM(F94:F95)","v":0}]
[null,null,"Membrane™ Control Panel","MCP - T300","N/C",null,{"$f":"IF(F94=0,\" \",\"N/C\")","v":" "}]
[null,null,"Pro-Panel™ Control Panel","PPC- T300",861,null,{"$f":"F95*E95","v":0}]
[]
[null,null,"Cleaning Technology: (conventional is standard,  ec-H2O NanoClean can also operate in conventional mode)",null,"Price",{"$f":"SUM(F98)","v":0}]
[null,null,"ec-H2O NanoClean™ Technology ","ec-H2ONC-T300",2117,null,{"$f":"F98*E98","v":0}]
[]
[null,null,"Drive Type  (Note 2)",null,"Price",{"$f":"SUM(F101:F102)","v":0}]
[null,null,"Pad / Brush Assist","Pad-T300","N/C",null,{"$f":"IF(F101=0,\" \",\"N/C\")","v":" "}]
[null,null,"Self Propel","Self-T300",1423,null,{"$f":"F102*E102","v":0}]
[]
[null,null,"Battery Type  (Note 3)",null,"Price",{"$f":"SUM(F105:F112)","v":0}]
[null,null,"Wet 105AH C/20  (kit of 2 batteries)       Not available with Cylindrical Machines",9013851,569,null,{"$f":"F105*E105","v":0}]
[null,null,"Wet 130AH C/20  (kit of 2 batteries)       Not available with Cylindrical Machines",9013852,642,null,{"$f":"F106*E106","v":0}]
[null,null,"Wet 150AH C/20  (kit of 2 batteries)",9013853,765,null,{"$f":"F107*E107","v":0}]
[null,null,"Sealed/MF AGM 140AH C/20  (kit of 2 batteries)",9013854,1868,null,{"$f":"F108*E108","v":0}]
[null,null,"Without",null,"N/C",null,{"$f":"IF(F109=0,\" \",\"N/C\")","v":" "}]
[null,null,null,null,null,{"$f":"SUM(F111)","v":0}]
[null,null,"Hydrolink® Battery Watering System - Wet 150AH Battery only (Note 4) ",9009619,513,null,{"$f":"F111*E111","v":0}]
[null,null,"Battery Lift Box - Quick Battery Exchange",9013850,161,null,{"$f":"F112*E112","v":0}]
[]
[null,null,"Charger","Reference Number","Price",{"$f":"SUM(F115:F117)","v":0}]
[null,null,"13A 85-265V AC 50/60Hz 1Ph - On Board",9013847,"N/C",null,{"$f":"IF(F115=0,\" \",\"N/C\")","v":" "}]
[null,null,"13A 85-265V AC 50/60Hz 1Ph - Off Board",1212837,"N/C",null,{"$f":"IF(F116=0,\" \",\"N/C\")","v":" "}]
[null,null,"Without",null,"N/C",null,{"$f":"IF(F117=0,\" \",\"N/C\")","v":" "}]
[]
[null,"Cleaning Performance",null,"Reference Number","Price",{"$f":"SUM(F120:F124)","v":0}]
[null,null,"Quiet ModeTM Sound Reduction",9013828,161,null,{"$f":"F120*E120","v":0}]
[null,null,"PVC Drain Hose with Drain Cap - Standard",9013841,"N/C",null,{"$f":"IF(F121=0,\" \",\"N/C\")","v":" "}]
[null,null,"Polyurethane (Oil Resistant) Drain Hose with Drain Cap",9013843,28,null,{"$f":"F122*E122","v":0}]
[null,null,"Polyurethane (Oil Resistant) Drain Hose with Drain Control Valve",9013844,126,null,{"$f":"F123*E123","v":0}]
[null,null,"Severe Environment Switch - ec-H2O NanoClean only  (Note 5)",9013840,538,null,{"$f":"F124*E124","v":0}]
[]
[null,"Machine Protection & Safety",null,"Reference Number","Price",{"$f":"SUM(F127:F128)","v":0}]
[null,null,"Parking Brake",9013846,167,null,{"$f":"F127*E127","v":0}]
[null,null,"Accessory Clips",9013845,14,null,{"$f":"F128*E128","v":0}]
[]
[null,"Brushes and Pads  (Note 6)",null,"Reference Number","Price",{"$f":"SUM(F131,F145,F159,F163,F171)","v":0}]
[null,null,"430mm/17\" Disk (1 Required)",null,null,{"$f":"SUM(F132:F143)","v":0}]
[null,null,"Polypropylene Brush",1213035,215,null,{"$f":"F132*E132","v":0}]
[null,null,"Nylon Brush",1213034,265,null,{"$f":"F133*E133","v":0}]
[null,null,"Abrasive Brush",1213037,355,null,{"$f":"F134*E134","v":0}]
[]
[null,null,"Pad Driver",1211869,301,null,{"$f":"F136*E136","v":0}]
[null,null,"Pads",null,null,{"$f":"SUM(F138:F143)","v":0}]
[null,null,"Brown Stripping - 3M",1050267,19.600000000000001,null,{"$f":"F138*E138","v":0}]
[null,null,"Blue Scrubbing - 3M",1050270,19.600000000000001,null,0]
[null,null,"Red Cleaning - 3M",1050271,19.600000000000001,null,0]
[null,null,"White Polishing - 3M",1050273,19.600000000000001,null,0]
[null,null,"Black Stripping-Hi Pro - 3M",1050262,27.6,null,0]
[null,null,"Maroon Surface Prep - 3M",1051028,26.8,null,0]
[]
[null,null,"500mm/20\" Disk (1 Required)",null,null,{"$f":"SUM(F146:F157)","v":0}]
[null,null,"Polypropylene Brush",1213032,248,null,{"$f":"F146*E146","v":0}]
[null,null,"Nylon Brush",1210386,276,null,0]
[null,null,"Abrasive Brush",1213033,483,null,{"$f":"F148*E148","v":0}]
[]
[null,null,"Pad Driver",1209197,317,null,{"$f":"F150*E150","v":0}]
[null,null,"Pads ",null,null,{"$f":"SUM(F152:F157)","v":0}]
[null,null,"Brown Stripping - 3M",17263,25.5,null,{"$f":"F152*E152","v":0}]
[null,null,"Blue Scrubbing - 3M",17262,25.5,null,0]
[null,null,"Red Cleaning - 3M",17261,25.5,null,0]
[null,null,"White Polishing - 3M",17260,25.5,null,0]
[null,null,"Black Stripping-Hi Pro - 3M",370094,28.5,null,0]
[null,null,"Maroon Surface Prep - 3M",1051030,30,null,{"$f":"F157*E157","v":0}]
[]
[null,null,"500 mm/20\" Dual Cylindrical (2 Required)",null,null,{"$f":"SUM(F160:F161)","v":0}]
[null,null,"Polypropylene Brush",1212762,121,null,{"$f":"F160*E160","v":0}]
[null,null,"Nylon Brush",1209188,199,null,{"$f":"F161*E161","v":0}]
[]
[null,null,"500mm/20\" Orbital (Standard)",null,null,{"$f":"SUM(F164:F169)","v":0}]
[null,null,"Pad Driver",null,"N/C",null,{"$f":"IF(F164=0,\" \",\"N/C\")","v":" "}]
[null,null,"Pads (Price is for 1, must order a carton which includes 10) ",null,null,{"$f":"SUM(F166:F169)","v":0}]
[null,null,"Blue Scrubbing - 3M",1205514,25,null,{"$f":"F166*E166","v":0}]
[null,null,"Red Cleaning - 3M",1205513,25,null,{"$f":"F167*E167","v":0}]
[null,null,"White Polishing - 3M",1205512,25,null,{"$f":"F168*E168","v":0}]
[null,null,"Maroon Surface Prep - 3M",1205515,62.1,null,{"$f":"F169*E169","v":0}]
[]
[null,null,"600mm/24\" Disk (2 Required)",null,null,{"$f":"SUM(F172:F183)","v":0}]
[null,null,"Polypropylene Brush",1213040,176,null,{"$f":"F172*E172","v":0}]
[null,null,"Nylon Brush",1210136,224,null,{"$f":"F173*E173","v":0}]
[null,null,"Abrasive Brush",1213041,371,null,{"$f":"F174*E174","v":0}]
[]
[null,null,"Pad Driver",1209160,203,null,{"$f":"F176*E176","v":0}]
[null,null,"Pads ",null,null,{"$f":"SUM(F178:F183)","v":0}]
[null,null,"Brown Stripping - 3M",385943,13.5,null,{"$f":"F178*E178","v":0}]
[null,null,"Blue Scrubbing - 3M",385942,13.5,null,0]
[null,null,"Red Cleaning - 3M",385941,13.5,null,0]
[null,null,"White Polishing - 3M",385940,13.5,null,0]
[null,null,"Black Stripping-Hi Pro - 3M",1063334,16.600000000000001,null,0]
[null,null,"Maroon Surface Prep - 3M",1051020,16.8,null,0]
[]
[null,"Support  (Note 7)",null,"Reference Number","Price",{"$f":"SUM(F186:F194)","v":0}]
[null,null,"T300 Operator Manual  - English",9014501,"N/C",null,{"$f":"IF(F186=0,\" \",\"N/C\")","v":" "}]
[null,null,"T300 Operator Manual  - Spanish",9014502,"N/C",null,{"$f":"IF(F187=0,\" \",\"N/C\")","v":" "}]
[null,null,"T300 Operator Manual -  French  (Note 8)",9014503,"N/C",null,{"$f":"IF(F188=0,\" \",\"N/C\")","v":" "}]
[null,null,"Additional Operator Manual","SEE ABOVE",55,null,{"$f":"F189*E189","v":0}]
[null,null,"T300 Parts Manual (Factory installed)",9014500,14,null,{"$f":"F190*E190","v":0}]
[null,null,"Additional T300 Parts Manual (After machine delivery)",9014500,54,null,{"$f":"F191*E191","v":0}]
[null,null,"Service Manual",9014510,"N/C",null,{"$f":"IF(F192=0,\" \",\"N/C\")","v":" "}]
[]
[null,null,"Packaging",null,null,{"$f":"SUM(F195:F195)","v":0}]
[null,null,"Skid w/Carton, Stackable ",9013859,"N/C",null,{"$f":"IF(F195=0,\" \",\"N/C\")","v":" "}]
[]
[null,"AFTERMARKET ITEMS (ordered separately) :",null,null,null,{"$f":"SUM(F199)","v":0}]
[]
[null,"Brushes and Pads (Replacements)",null,"Reference Number","CAD Price",{"$f":"SUM(F200,F215,F230,F234:F235,F244)","v":0}]
[null,null,"430mm/17\" Disk (1 Required)",null,null,{"$f":"SUM(F201:F213)","v":0}]
[null,null,"Polypropylene Brush",1213035,280,null,{"$f":"F201*E201","v":0}]
[null,null,"Nylon Brush",1213034,341.6,null,{"$f":"F202*E202","v":0}]
[null,null,"Abrasive Brush",1213037,454.9,null,{"$f":"F203*E203","v":0}]
[]
[null,null,"Pad Driver",1211869,301,null,{"$f":"F205*E205","v":0}]
[null,null,"Pads",null,null,{"$f":"SUM(F207:F213)","v":0}]
[null,null,"Brown Stripping - 3M",1050267,19.600000000000001,null,{"$f":"F207*E207","v":0}]
[null,null,"Blue Scrubbing - 3M",1050270,19.600000000000001,null,0]
[null,null,"Red Cleaning - 3M",1050271,19.600000000000001,null,0]
[null,null,"White Polishing - 3M",1050273,19.600000000000001,null,0]
[null,null,"Black Stripping-Hi Pro - 3M",1050262,27.6,null,0]
[null,null,"Maroon Surface Prep - 3M",1051028,26.8,null,0]
[null,null,"Purple Polishing - 3M  (Case of 5 Pads)",1073766,478.79999999999995,null,{"$f":"F213*E213","v":0}]
[]
[null,null,"500mm/20\" Disk (1 Required)",null,null,{"$f":"SUM(F216:F228)","v":0}]
[null,null,"Polypropylene Brush",1213032,339.8,null,{"$f":"F216*E216","v":0}]
[null,null,"Nylon Brush",1210386,357,null,{"$f":"F217*E217","v":0}]
[null,null,"Abrasive Brush",1213033,589.70000000000005,null,{"$f":"F218*E218","v":0}]
[]
[null,null,"Pad Driver",1209197,322.3,null,{"$f":"F220*E220","v":0}]
[null,null,"Pads ",null,null,{"$f":"SUM(F222:F228)","v":0}]
[null,null,"Brown Stripping - 3M",17263,25.5,null,{"$f":"F222*E222","v":0}]
[null,null,"Blue Scrubbing - 3M",17262,25.5,null,0]
[null,null,"Red Cleaning - 3M",17261,25.5,null,0]
[null,null,"White Polishing - 3M",17260,25.5,null,0]
[null,null,"Black Stripping-Hi Pro - 3M",370094,28.5,null,0]
[null,null,"Maroon Surface Prep - 3M",1051030,30,null,0]
[null,null,"Purple Polishing - 3M  (Case of 5 Pads)",1073751,540.9,null,0]
[]
[null,null,"500 mm/20\" Dual Cylindrical (2 Required)",null,null,{"$f":"SUM(F231:F232)","v":0}]
[null,null,"Polypropylene Brush",1212762,162.19999999999999,null,{"$f":"F231*E231","v":0}]
[null,null,"Nylon Brush",1209188,267.60000000000002,null,{"$f":"F232*E232","v":0}]
[]
[null,null,"500mm/20\" Orbital (Standard)",null,null,{"$f":"SUM(F235:F241)","v":0}]
[null,null,"Pads (Price is for 1, must order a carton of 10) ",null,null,{"$f":"SUM(F236:F242)","v":0}]
[null,null,"Blue Scrubbing - 3M",1205514,25,null,{"$f":"F236*E236","v":0}]
[null,null,"Red Cleaning - 3M",1205513,25,null,0]
[null,null,"White Polishing - 3M",1205512,25,null,0]
[null,null,"Maroon Surface Prep - 3M",1205515,62.1,null,0]
[null,null,"Red Backer Pad with (2) Strips of Velcro",9010674,86.6,null,0]
[null,null,"Purple Polishing - 3M  (Case of 5 Pads)",1073757,640.4,null,0]
[null,null,"Green Turf Pads (Case of 4 Pads)",1074740,378,null,{"$f":"F242*E242","v":0}]
[]
[null,null,"600mm/24\" Disk (2 Required)",null,null,{"$f":"SUM(F245:F257)","v":0}]
[null,null,"Polypropylene Brush",1213040,231.3,null,{"$f":"F245*E245","v":0}]
[null,null,"Nylon Brush",1210136,297,null,{"$f":"F246*E246","v":0}]
[null,null,"Abrasive Brush",1213041,371,null,{"$f":"F247*E247","v":0}]
[]
[null,null,"Pad Driver",1209160,266.7,null,{"$f":"F249*E249","v":0}]
[null,null,"Pads ",null,null,{"$f":"SUM(F251:F257)","v":0}]
[null,null,"Brown Stripping - 3M",385943,13.5,null,{"$f":"F251*E251","v":0}]
[null,null,"Blue Scrubbing - 3M",385942,13.5,null,0]
[null,null,"Red Cleaning - 3M",385941,13.5,null,0]
[null,null,"White Polishing - 3M",385940,13.5,null,0]
[null,null,"Black Stripping-Hi Pro - 3M",1063334,16.600000000000001,null,0]
[null,null,"Maroon Surface Prep - 3M",1051020,16.8,null,0]
[null,null,"Purple Polishing - 3M  (Case of 5 Pads)",1073747,315.89999999999998,null,0]
[]
[null,"Maintenance Items",null,"Reference Number","Price",{"$f":"SUM(F260:F274)","v":0}]
[null,null,"13A 85-265V AC 50/60Hz 1Ph - On Board",1202261,566.29999999999995,null,{"$f":"F260*E260","v":0}]
[null,null,"13A 85-265V AC 50/60Hz 1Ph - Off Board",1212837,441,null,0]
[null,null,"Squeegee Blade Front, Linatex - Standard",1203954,17.100000000000001,null,0]
[null,null,"Squeegee Blade Rear, Linatex - Standard",1203953,18.899999999999999,null,0]
[null,null,"Squeegee Blade Front, Gum Rubber",1215612,10.5,null,0]
[null,null,"Squeegee Blade Rear, Gum Rubber",1215610,19.600000000000001,null,0]
[null,null,"Squeegee Blade Front, Urethane",1215611,41.1,null,0]
[null,null,"Squeegee Blade Rear, Urethane",1215609,59.3,null,{"$f":"F267*E267","v":0}]
[null,null,"PVC material recovery hose",1211220,22.9,null,{"$f":"F268*E268","v":0}]
[null,null,"PVC material drain hose with drain cap",1213010,31.5,null,0]
[null,null,"Polyurethane material recovery hose",1204663,36,null,0]
[null,null,"Polyurethane material drain hose with drain cap",1213008,43.4,null,0]
[null,null,"Polyurethane material drain hose with drain control valve",9014171,258,null,0]
[null,null,"Debris Tray Deflector Kit",9014872,31.5,null,{"$f":"F273*E273","v":0}]
[null,null,"ecH2O NanoClean WCM 270ML Cartridge",9013646,221.2,null,0]
[]
[null,"Custom Solution--write in description, qty, price, and PN if applicable",null,null,null,{"$f":"SUM(F277)","v":0}]
[null,null,null,null,"Insert Prices Here",{"$f":"SUM(F278:F281)","v":0}]
[null,null,null,"Custom",null,{"$f":"IF(E278 <> \"\", 1, 0)","v":0},{"$f":"F278*E278","v":0}]
[null,null,null,"Custom",null,{"$f":"IF(E279 <> \"\", 1, 0)","v":0},{"$f":"F279*E279","v":0}]
[null,null,null,"Custom",null,{"$f":"IF(E280 <> \"\", 1, 0)","v":0},{"$f":"F280*E280","v":0}]
[null,null,null,"Custom",null,{"$f":"IF(E281 <> \"\", 1, 0)","v":0},{"$f":"F281*E281","v":0}]
[null,null,"Prepaid and Add","Freight",null,1,{"$f":"F282*E282","v":0}]
[null,null,"Subject to all applicable taxes","Tax",null,1,{"$f":"F283*E283","v":0}]
[]
[null,null,null,"MACHINE TOTAL*",null,null,{"$f":"SUM(G58:G283)","v":0},null,null,null,null,null,null,"This goes to \"My Documents\""]
[null,null,null,null,null,null,{"$f":"SUM(G285)","v":0}]
[]
[null,null,"National Leasing - Leasing Calculation Option:","Finance Option 1",null,"Finance Option 2",null,null,{"$f":"Financing!A38","v":"Rates 2016 - Rev. 7/1/2016"}]
[null,null,"Purchase Option:",1,null,"FMV Scrubber",null,null,{"$f":"Financing!A39","v":"“Blank Payment Amounts Indicate The Financing Option Or Purchase Options Selected Are Not "}]
[null,null,"24 Months",0,null,0,null,null,{"$f":"Financing!A40","v":"Applicable Or The Machine Total Is Below The Minimum Amount For The Selected Vendor”"}]
[null,null,"36 Months",0,null,0,null,null,{"$f":"Financing!A41","v":"\"Quoted monthly payments are estimates only and are based on a certain level of credit rating."}]
[null,null,"48 Months",0,null,0,null,null,{"$f":"Financing!A42","v":"Actual monthly payments may be higher depending on your credit rating.\""}]
[null,null,"60 Months",0,null,0,null,null,{"$f":"Financing!A43","v":"“Financing rates do not include Pre-Paid Service”"}]
[null,"   TennantTrue",null,null,0,0]
[]
[null,null,"Is customer interested in service program?","Yes","*State/County selection required for TennantTrue service options"]
[]
[null,null,"If not, why?"]
[]
[null,null,"Term:",36,null,null,"AB Brushes","No"]
[null,null,"Monthly machine usage (hrs):",25]
[]
[null,null,"TennantTrue: ","Rate Per Unit",null,"Hourly Labor Rate",null,"Site Visit Charge"]
[null,null,"Gold - Monthly",70]
[null,null,"Gold - Pre Pay Full Term",2344]
[null,null,"Silver - Monthly",50]
[null,null,"Silver - Annually",592]
[null,null,"Silver - Pre Pay Full Term",1737]
[null,null,"Silver - Per Visit",310]
[null,null,"Pay As You Go",null,null,null,null,null,null,null,"*State/County selection required for 'Pay As You Go' and 'On Demand'."]
[null,null,"On Demand"]
[]
[]
[]
[null,"Quote Special Instructions:"]
[]
[]
[null,{"$f":"Start_Here!E33","v":"Terms and Conditions"}]
[null,{"$f":"Start_Here!E34","v":"Ask your local sales rep for estimated lead times. Verify when placing order"}]
[null,{"$f":"Start_Here!E35","v":"All orders subject to acceptance by Tennant Sales and Service Company, Minneapolis, Minnesota"}]
[null,{"$f":"Start_Here!E36","v":"Prices subject to change without notice. Subject to any applicable taxes."}]
[null,{"$f":"Start_Here!E37","v":"Terms:  Net 30 days.  Payable in Canadian Funds"}]
[null,{"$f":"Start_Here!E38","v":"Freight:  Accessories, parts, supplies, detergents, and floor coatings orders delivered DDP "}]
[null,{"$f":"Start_Here!E39","v":"shipping point Frt PPD.  Machine orders delivered DDP shipping point Frt PPD and add."}]
[null,{"$f":"Start_Here!E40","v":"Returned Merchandise is subject to a restocking fee."}]
[null,{"$f":"Start_Here!E42","v":"Printed General Terms and Conditions are also available upon request."}]
[null,{"$f":"Start_Here!E43","v":0}]
[]
[]
[null,null,null,null,"Quote Date :",null,{"$f":"Letter!$A$25","v":"2014-10-02"}]
["Order Placement Information:  To place your order, fill in PO# and customer signatures,"]
["call or fax to the numbers listed below. Customer Purchase Order is required."]
["If information is missing, orders will be entered and held until all information is received."]
[null,null,"Customer Number",null,{"$f":"Start_Here!F15","v":"Cust Grp 3"}]
[null,null,{"$f":"Start_Here!$F$5","v":0},null,{"$f":"Start_Here!F16","v":0}]
[null,null,{"$f":"Start_Here!$B$18","v":"Sold To Information (Please Verify)"}]
["Company",null,{"$f":"Start_Here!$C$19","v":""}]
["Address",null,{"$f":"Start_Here!$C$20","v":""}]
[null,null,{"$f":"Start_Here!$C$21","v":""}]
["Name",null,{"$f":"Start_Here!$C$22","v":""}]
["Phone",null,{"$f":"Start_Here!$C$23","v":""}]
[null,null,{"$f":"Start_Here!$B$11","v":"Ship To Information (Please Verify)"}]
["Company",null,{"$f":"Start_Here!$C$12","v":""}]
["Address",null,{"$f":"Start_Here!$C$13","v":""}]
[null,null,{"$f":"Start_Here!$C$14","v":""}]
["Name",null,{"$f":"Start_Here!$C$15","v":""}]
["Phone",null,{"$f":"Start_Here!$C$16","v":""}]
[null,null,{"$f":"Start_Here!$B$25","v":"Shipping/Carrier Instructions:"},null,"Order Special Instructions:"]
[null,null,{"$f":"Start_Here!$C$26","v":0}]
[]
[null,null," Customer Purchase Order No. "]
[null,null," (please attach copy) "]
[]
[]
[null,null," Tax Exempt ",null," Yes "]
[null,null,null,null," No "]
[null,null," If Yes, attach a copy of your exemption certificate. "]
[]
[null,null," Requested Delivery Date "]
[null,null,{"$f":"Start_Here!$F$14","v":0}]
[null,null,{"$f":"Start_Here!$F$8","v":0},null,{"$f":"Start_Here!$F$11","v":0}]
[null,null," Authorized Buyer (please print) ",null," Phone Number "]
[]
[null,null," Authorized Buyer Signature "]
[]
[null,null,"Tennant Representative"]
["Specialized Maintenance Equipment"]
[{"$f":"Start_Here!$C$45","v":"TENNANT · 701 NORTH LILAC DRIVE · P.O. BOX 1452 · MINNEAPOLIS, MN 55440-1452 ·"}]
[{"$f":"Start_Here!$C$46","v":" PHONE:800-553-8033 · FAX:763-513-2116"}]
[]
[null,"SPECIAL INFORMATION"]
[null,"Notes"]
[null,"Notes"]
[null,1,"Pre-Configured Machines cannot add or change options.  All units are shipped via stackable skid with carton."]
[null,null,"When ordering, provide the reference number listed above.  Price does not include freight or tax.  Availability of units "]
[null,null,"and lead time may vary."]
[]
[null,2,"Pad Assist Drive Type is only available on the 430 mm/17\" and 500 mm/20\" units."]
[null,null,"Self Propel Drive Type is available on all machine types."]
[null,null,"The Self Propel price is included in the Cleaning Type section for Dual Disk, Dual Cylindrical and Orbital machines"]
[]
[null,3,"To maximize run time, it is recommend that the Wet 150AH Batteries are ordered."]
[null,null,"Sealed/MF AGM 140AH Battery available on all units."]
[null,null,"Wet 105AH and Wet 130AH Batteries are not available on Dual Cylindrical machines."]
[]
[null,4,"Hydrolink® Battery Watering System is only available Wet 150AH lead acid batteries.  "]
[]
[null,5,"The Severe Envionment Switch can only be chosen when ec-H20 NanoClean Technolgy has been selected."]
[]
[null,6,"One Pad Driver or Brush can be selected with 430 mm/17\" and 500 mm/20\" Models"]
[null,null,"A Set of two Pad Drivers or Brushes can be selected for 24\" Models"]
[null,null,"Pad Driver is included in the base machine price of Orbital Models."]
[null,null,"A Set of two Cylindrical Brushes can be selected for the Dual Cylindrical Model"]
[]
[null,7,"Additional hard copy Operator and Parts Manuals can be ordered or digital copies can be downloaded from www.Tennantco.com."]
[]
[null,8,"A French and English manual will be supplied for all units shipping into Quebec, Canada at no charge.  An additional manual"]
[null,null,"can be ordered (for a total of 3 manuals) for an additional charge as stated under 'Additional Operator Manual'."]
[]
[null,9,"Pre-Paid and Monthly Packages are available for the IRIS Information Service. IRIS Module is required and NOT included in the price of the IRIS Information Service:"]
[null,null,"3 Year Pre-Paid IRIS Information Service                 $350.00"]
[null,null,"5 Year Pre-Paid IRIS Information Service                 $560.00"]
[null,null,"A monthly contract can be set up at $14 per month w/ 12 month minimum commitment."]
[null,null,"IRIS Telemetry Module only covers the price of the hardware. IRIS Telemetry requires an IRIS Telemetry Module and an IRIS Information Service Package."]
[]
[null,10,"Shipping Weights and Dimensions",null,"Skid w/Carton"]
[]
[null,null,"430 mm/17\" Single Model"]
[null,null,"Weight (w/105AH Battery Pad Drive)",null,"500 lbs / 227 Kg"]
[null,null,"Weight (w/130AH Battery Self Propel Drive)"]
[null,null,"Length",null,"59\" / 1500 mm"]
[null,null,"Width",null,"31\" / 787 mm"]
[null,null,"Height",null,"44\" / 1118 mm"]
[]
[null,null,"500 mm /20\" Single Disk Model"]
[null,null,"Weight (w/130AH Battery Pad Drive)",null,"500 lbs / 227 Kg"]
[null,null,"Weight (w/150AH Battery Self Propel)"]
[null,null,"Length",null,"59\" / 1500 mm"]
[null,null,"Width",null,"31\" / 787 mm"]
[null,null,"Height",null,"44\" / 1118 mm"]
[]
[null,null,"600 mm/24\" Dual Disk Model"]
[null,null,"Weight (w/150AH Battery)",null,"538 lbs / 244 Kg"]
[null,null,"Length",null,"59\" / 1500 mm"]
[null,null,"Width",null,"31\" / 787 mm"]
[null,null,"Height",null,"44\" / 1118 mm"]
[]
[null,null,"500 mm /20\" Dual Cylindrical Model"]
[null,null,"Weight (w/150AH Battery)",null,"526 lbs / 239 Kg"]
[null,null,"Length",null,"59\" / 1500 mm"]
[null,null,"Width",null,"32\" / 800 mm"]
[null,null,"Height",null,"44\" / 1118 mm"]
[]
[null,null,"500 mm /20\" Orbital Model"]
[null,null,"Weight (w/150AH Battery)",null,"526 lbs / 239 Kg"]
[null,null,"Length",null,"59\" / 1500 mm"]
[null,null,"Width",null,"32\" / 800 mm"]
[null,null,"Height",null,"44\" / 1118 mm"]

{"sheet":"T300e","index":9,"n_rows":478,"n_cols":14,"rows_kept":478,"cut":false,"hidden":false,"merged":[[455,4,456,4],[448,4,449,4],[388,4,388,6],[392,2,392,4],[400,4,400,5],[335,4,335,8],[337,3,337,6],[339,3,339,4],[340,3,340,4],[342,3,342,4],[342,5,342,6],[342,7,342,8],[385,2,385,5],[386,2,386,5],[355,1,355,6],[374,4,374,6],[376,2,376,5],[377,2,377,5],[378,2,378,5],[379,2,379,5],[380,2,380,5],[382,2,382,5],[383,2,383,5],[384,2,384,5],[349,7,349,8],[350,3,350,4],[350,5,350,6],[350,7,350,8],[347,3,347,4],[347,5,347,6],[347,7,347,8],[348,3,348,4],[348,5,348,6],[348,7,348,8],[349,3,349,4],[349,5,349,6],[345,7,345,8],[346,3,346,4],[346,5,346,6],[346,7,346,8],[343,3,343,4],[343,5,343,6],[343,7,343,8],[344,3,344,4],[344,5,344,6],[344,7,344,8],[345,3,345,4],[345,5,345,6],[330,3,330,4],[330,5,330,6],[331,3,331,4],[331,5,331,6],[332,3,332,4],[332,5,332,6],[327,3,327,4],[327,5,327,6],[328,3,328,4],[328,5,328,6],[329,3,329,4],[329,5,329,6],[40,2,40,6],[41,2,41,6],[72,2,72,4],[73,2,73,4],[75,2,75,4],[36,2,36,6],[37,2,37,6],[38,2,38,6],[39,2,39,6],[0,2,0,3],[1,2,1,3],[2,2,2,3],[3,2,3,3],[11,2,11,6],[17,2,17,3]]}
["T300e",null,{"$f":"Start_Here!$C$8","v":"Contact Name"}]
[null,null,{"$f":"Start_Here!$C$5","v":"Company Name"}]
[null,null,{"$f":"Start_Here!$C$6","v":"Address"}]
[null,null,{"$f":"Start_Here!$C$7","v":"City, State Zip"}]
[null,null,{"$f":"Start_Here!$C$39","v":"Rep Name"}]
[null,null,{"$f":"Start_Here!$C$35","v":"Tennant Sales and Service Company"}]
[null,null,{"$f":"Start_Here!$C$36","v":"701 North Lilac Drive"}]
[null,null,{"$f":"Start_Here!$C$38","v":"Minneapolis, MN 55440-1452"}]
[null,null,{"$f":"Start_Here!$C$41","v":"800-553-8033"},null,"Quote Date :",null,{"$f":"Letter!$A$25","v":"2014-10-02"}]
[]
[]
[null,null,"BUILT-IN “TENNANT VALUE” INCLUDES:"]
[]
[null,null,"42L/11 gal Solution Tank  & 53 L/14 gal Recovery Tank",null,"Wet 105AH, Wet 130AH, and Wet 150AH Battery options available."]
[null,null,"Rugged DuramerTM Rotomold Tank Construction",null,"Emergency Stop  (standard on all drive units)"]
[null,null,"HygienicTM Recovery Tank",null,"Free Floating Head Skirt (disk machines)"]
[null,null,"Single Setting Down Pressure (Standard)",null,"Yellow Debris Hopper (cylindrical machines)"]
[null,null,"Multiple Setting Down Pressure (Optional)",null,"Front Water Fill Port w/ Hose Hook"]
[null,null,"Adjustable Solution Flow",null,"Integrated Heat Sync for Electronics Protection"]
[null,null,"Standard Low Noise Level  (≤65 dBa)",null,"Sealed Electrical Connectors"]
[null,null,"0.75 kW/1 HP brush motor, 230 RPM (disk)",null,"Battery Tray"]
[null,null,"0.75 kW/1 HP brush motor, 1000 RPM (cylindrical)",null,"On-board Charger with 3m/15 ft power cord"]
[null,null,"0.45 kW/0.6 HP brush motor, 2200 RPM (orbital)",null,"Closed Machine Venting for Battery Charging"]
[null,null,"Composite Scrub Deck (Single Disk)",null,"Recovery Tank Debris Tray with deflector "]
[null,null,"Cast Aluminum Scrub Deck (Dual Disk & Cylindrical)",null,"Unsurpassed Ergonomic Design"]
[null,null,"11 Gauge Steel Scrub Deck (Orbital Only)",null,"Gray Non-Marking Tires"]
[null,null,"Three Lug Pad Driver System (Standard Disk Machine)",null,"10cm /4\" Edge & Reach Under Cleaning"]
[null,null,"Insta-ClickTM Pad Driver Attachment (Option Disk machines)",null,"Anti-Static Straps"]
[null,null,"Cast Aluminum Squeegee Frame",null,"Key Switch for Safety"]
[null,null,"Breakaway Squeegee Design w/ Integrated P-Trap",null,"Hour Meter"]
[null,null,"Factory Set Squeegee Assembly for Maximium Recovery",null,"Operators manual"]
[null,null,"Linatex Squeegee Blades with Tool-less Replacement",null,"Jacking Points/Shipping Tie Downs"]
[null,null,"Yellow Maintenance Touch Points"]
[null,null,"Integrated Accessory Rails w/ Squegee & Bag Hang ",null,"Available with Optional ec-H2O NanoClean™ Technology"]
[]
[]
[null,null,"TENNANT COMPANY WARRANTY"]
[null,null,"3 YEARS OR 2000 HOURS - PARTS"]
[null,null,"1 YEAR - BATTERY CHARGERS"]
[null,null,"2 YEARS - LABOR"]
[null,null,"6 MONTHS - TRAVEL"]
[null,null,"10 YEARS ON DURAMERTM ROTOMOLD TANKS"]
[]
[null,null,null,null,"                Quote Request Information"]
[null,null,null,null,null,null,"Fax (quote only)"]
[null,null,null,null,null,null,"Mail (quote,lit, specs)"]
[null,null,null,null,null,null,"Fax + Mail"]
[null,null,null,null,"                Primary Use"]
[null,null,null,null,null,null,"Inside"]
[null,null,null,null,null,null,"Outside"]
[]
[null,null,"Description","Reference #","Price Each","Qty","Extended Price"]
[null,"Pre-Configured Machines (Note 1)",null,null,"CANADA",{"$f":"SUM(F54,F66,F69)","v":0}]
[null,null,"T300e Walk-Behind Scrubber - Disk",null,null,{"$f":"SUM(F55:F64)","v":0}]
[null,null,"430mm / 17\" Disk, Pad Assist,  Single Down Pressure, Conventional Tool Attachment, Conventional Scrubbing,  105AH Battery, On-Board Charger","MV-T300e-0001",6607,null,{"$f":"F55*E55","v":0},null,null,null,null,{"$f":"SUM(F55)","v":0},"Surcharge Qty"]
[null,null,"430mm / 17\" Disk, Pad Assist, Single Down Pressure, Conventional Tool Attachment, ec-H2O NanoClean, 105AH Battery, On-Board Charger","MV-T300e-0002",8724,null,0,null,null,null,null,{"$f":"SUM(F56)","v":0},"Surcharge Qty"]
[null,null,"500mm / 20\" Disk, Pad Assist, Single Down Pressure, Conventional Tool Attachment, Conventional Scrubbing, 105AH Battery, On-Board Charger","MV-T300e-0003",7378,null,0,null,null,null,null,0,"Surcharge Qty"]
[null,null,"500mm / 20\" Disk, Self Propel, Multiple Down Pressure, Conventional Tool Attachment, Conventional Scrubbing, 130AH, On-Board Charger","MV-T300E-0041",9127,null,{"$f":"F58*E58","v":0}]
[null,null,"500mm / 20\" Disk, Self Propel, Multiple Down Pressure, Conventional Tool Attachment, ec-H2O NanoClean, 130AH Battery, On-Board Charger","MV-T300E-0042",11244,null,{"$f":"F59*E59","v":0}]
[null,null,"500mm / 20\" Disk, Pad Assist, Single Down Pressure, Insta-Click™ Tool Attachment, ec-H20 NanoClean, 105AH Battery, On-Board Charger","MV-T300e-0004",9873,null,0,null,null,null,null,0,"Surcharge Qty"]
[null,null,"500mm / 20\" Disk, Self Propel, Multiple Down Pressure, Insta-Click™ Tool Attachment, Conventional Scrubbing, 130 AH Battery, On-Board Charger","MV-T300e-0005",9575,null,0,null,null,null,null,0,"Surcharge Qty"]
[null,null,"500mm / 20\" Disk, Self Propel, Multiple Down Pressure, Insta-Click™ Tool Attachment, ec-H2O NanoClean™, 130AH Battery, On-Board Charger","MV-T300e-0006",11692,null,0,null,null,null,null,0,"Surcharge Qty"]
[null,null,"600mm / 24\" Disk, Self Propel, Single Down Pressure, Conventional Tool Attachment, Conventional Scrubbing, 150AH Battery, On-Board Charger","MV-T300e-0007",9512,null,0,null,null,null,null,0,"Surcharge Qty"]
[null,null,"600mm / 24\" Disk, Self Propel, Multiple Down Pressure, Insta-Click™ Tool Attachment, ec-H2O NanoClean™, 150AH Battery, On-Board Charger","MV-T300e-0008",12330,null,{"$f":"F64*E64","v":0},null,null,null,null,0,"Surcharge Qty"]
[null,null,null,null,null,null,null,null,null,null,null,{"$f":"SUM(F65)","v":0},"Surcharge Qty"]
[null,null,"T300e Walk-Behind Scrubber - Dual Cylindrical",null,null,{"$f":"SUM(F67)","v":0}]
[null,null,"500mm / 20\" Cylindrical, Self Propel, Multiple Down Pressure,  ec-H2O NanoClean™, 150AH Battery, On-Board Charger","MV-T300e-0011",13741,null,{"$f":"F67*E67","v":0}]
[]
[null,null,"T300e Walk-Behind Scrubber - Orbital",null,null,{"$f":"SUM(F70:F71)","v":0}]
[null,null,"500mm / 20\" Orbital, Self Propel, Multiple Down Pressure, Conventional Scrubbing, 150AH Battery, On-Board Charger","MV-T300e-0009",9751,null,{"$f":"F70*E70","v":0}]
[null,null,"500mm / 20\" Orbital, Self Propel, Multiple Down Pressure, ec-H2O NanoClean™, 150AH Battery, On-Board Charger","MV-T300e-0010",11868,null,{"$f":"F71*E71","v":0}]
[]
[null,null,"All units above include Standard Battery and On-Board Charger unless otherwise stated.",null,null,{"$f":"SUM(F55:F71)","v":0}]
[null,null,"All pre-configured disk machines include pad drivers and dual cylindrical machines included two nylon brushes.",null,null,{"$f":"SUM(F56:F72)","v":0}]
[null,null,null,null,null,{"$f":"SUM(F57:F73)","v":0}]
[null,null,"All Pre-Configured Machines are packaged in a Skid w/Carton for shipment via LTL carriers.  No additional options can be added or changed.",null,null,{"$f":"SUM(F60:F74)","v":0}]
[]
[null,"Base Configuration",null,null,"CANADA List Price",{"$f":"SUM(F79,F86,F90,F93,F97,F108,F113)","v":0}]
[null,null,"Cleaning Type",null,null,{"$f":"SUM(F80:F84)","v":0}]
[null,null,"T300e Walk-Behind Scrubber  430 mm/17\" - Disk","T300e-430-D",5737,null,{"$f":"F80*E80","v":0}]
[null,null,"T300e Walk-Behind Scrubber  500 mm/20\" - Disk","T300e-500-D",6493,null,{"$f":"F81*E81","v":0}]
[null,null,"T300e Walk-Behind Scrubber  600 mm/24\" - Dual Disk, Self Propel","T300e-600-D",8341,null,{"$f":"F82*E82","v":0}]
[null,null,"T300e Walk-Behind Scrubber  500 mm/20\" - Dual Cylindrical, Self Propel","T300e-500-C",10139,null,{"$f":"F83*E83","v":0}]
[null,null,"T300e Walk-Behind Scrubber  500 mm/20\" - Orbital, Self Propel","T300e-500-O",8663,null,{"$f":"F84*E84","v":0}]
[]
[null,null,"Cleaning Tool Attachment","Reference Number","Price",{"$f":"SUM(F87:F88)","v":0}]
[null,null,"Conventional - 3 Lug","CNV-T300e","N/C",null,{"$f":"IF(F87=0,\" \",\"N/C\")","v":" "}]
[null,null,"Insta-Click™","IC-T300e",378,null,{"$f":"F88*E88","v":0}]
[]
[null,null,"Cleaning Technology: (conventional is standard,  ec-H2O NanoClean can also operate in conventional mode)",null,"Price",{"$f":"SUM(F91)","v":0}]
[null,null,"ec-H2O NanoClean™ Technology ","ec-H2ONC-T300e",2117,null,{"$f":"F91*E91","v":0}]
[]
[null,null,"Drive Type  (Note 2)","Reference Number","Price",{"$f":"SUM(F94:F95)","v":0}]
[null,null,"Pad / Brush Assist","Pad-T300e","N/C",null,{"$f":"IF(F94=0,\" \",\"N/C\")","v":" "}]
[null,null,"Self Propel","Self-T300e",1423,null,{"$f":"F95*E95","v":0}]
[]
[null,null,"Battery Type  (Note 3)","Reference Number","Price",{"$f":"SUM(F98:F105)","v":0}]
[null,null,"Wet 105AH C/20  (Kit of 2 batteries)       Not available with Cylindrical Machines",9013851,569,null,{"$f":"F98*E98","v":0}]
[null,null,"Wet 130AH C/20  (Kit of 2 batteries)       Not available with Cylindrical Machines",9013852,642,null,{"$f":"F99*E99","v":0}]
[null,null,"Wet 150AH C/20  (Kit of 2 batteries)",9013853,765,null,{"$f":"F100*E100","v":0}]
[null,null,"Sealed/MF AGM 140AH C/20  (Kit of 2 batteries)",9013854,1868,null,{"$f":"F101*E101","v":0}]
[null,null,"Without",null,"N/C",null,{"$f":"IF(F102=0,\" \",\"N/C\")","v":" "}]
[null,null,null,null,null,{"$f":"SUM(F104:F105)","v":0}]
[null,null,"Hydrolink® Battery Watering System - Wet 150AH Battery only (Note 4) ",9009619,513,null,{"$f":"F104*E104","v":0}]
[null,null,"Battery Lift Box - Quick Battery Exchange",9013850,161,null,{"$f":"F105*E105","v":0}]
[]
[]
[null,null,"Charger","Reference Number","Price",{"$f":"-SUM(F109:F111)","v":0}]
[null,null,"13A 85-265V AC 50/60Hz 1Ph - On Board",9013847,"N/C",null,{"$f":"IF(F109=0,\" \",\"N/C\")","v":" "}]
[null,null,"13A 85-265V AC 50/60Hz 1Ph - Off Board",1212837,"N/C",null,{"$f":"IF(F110=0,\" \",\"N/C\")","v":" "}]
[null,null,"Without",null,"N/C",null,{"$f":"IF(F111=0,\" \",\"N/C\")","v":" "}]
[]
[null,null,"Down Pressure  (Note 5)","Reference Number","Price",{"$f":"SUM(F114:F116)","v":0}]
[null,null,"Single",9013833,"N/C",null,{"$f":"IF(F114=0,\" \",\"N/C\")","v":" "}]
[null,null,"Multiple (Dual Down Pressure) - Disk and Orbital",9013831,324,null,{"$f":"F115*E115","v":0}]
[null,null,"Multiple (Dual Down Pressure) - Dual Cylindrical",9013832,324,null,{"$f":"F116*E116","v":0}]
[]
[null,"Cleaning Performance",null,"Reference Number","Price",{"$f":"SUM(F119:F121)","v":0}]
[null,null,"PVC Drain Hose with Drain Cap - Standard",9013841,"N/C",null,{"$f":"IF(F119=0,\" \",\"N/C\")","v":" "}]
[null,null,"Polyurethane (Oil Resistant) Drain Hose with Drain Cap",9013843,28,null,{"$f":"F120*E120","v":0}]
[null,null,"Polyurethane (Oil Resistant) Drain Hose with Drain Control Valve",9013844,126,null,{"$f":"F121*E121","v":0}]
[]
[null,"Machine Protection & Safety",null,"Reference Number","Price",{"$f":"SUM(F124:F125)","v":0}]
[null,null,"Parking Brake",9013846,167,null,{"$f":"F124*E124","v":0}]
[null,null,"Accessory Clips",9013845,14,null,{"$f":"F125*E125","v":0}]
[]
[null,"Brushes and Pads  (Note 6)",null,"Reference Number","Price",{"$f":"SUM(F128,F149,F170,F174,F182)","v":0}]
[null,null,"430mm/17\" Disk (1 Required)",null,null,{"$f":"SUM(F129,F135,F141)","v":0}]
[null,null,"For Conventional Scrub Head:",null,null,{"$f":"SUM(F130:F133)","v":0}]
[null,null,"Polypropylene Brush",1016765,215,null,{"$f":"F130*E130","v":0}]
[null,null,"Nylon Brush",1016764,265,null,{"$f":"F131*E131","v":0}]
[null,null,"Abrasive Brush",1016763,255,null,{"$f":"F132*E132","v":0}]
[null,null,"Pad Driver",1212965,210,null,{"$f":"F133*E133","v":0}]
[]
[null,null,"For Insta-Click™ Scrub Head:",null,null,{"$f":"SUM(F136:F139)","v":0}]
[null,null,"Polypropylene Brush",1213035,215,null,{"$f":"F136*E136","v":0}]
[null,null,"Nylon Brush",1213034,265,null,{"$f":"F137*E137","v":0}]
[null,null,"Abrasive Brush",1213037,355,null,{"$f":"F138*E138","v":0}]
[null,null,"Pad Driver",1211869,301,null,{"$f":"F139*E139","v":0}]
[]
[null,null,"Pads",null,null,{"$f":"SUM(F142:F147)","v":0}]
[null,null,"Brown Stripping - 3M",1050267,19.600000000000001,null,{"$f":"F142*E142","v":0}]
[null,null,"Blue Scrubbing - 3M",1050270,19.600000000000001,null,0]
[null,null,"Red Cleaning - 3M",1050271,19.600000000000001,null,0]
[null,null,"White Polishing - 3M",1050273,19.600000000000001,null,0]
[null,null,"Black Stripping-Hi Pro - 3M",1050262,27.6,null,0]
[null,null,"Maroon Surface Prep - 3M",1051028,26.8,null,0]
[]
[null,null,"500mm/20\" Disk (1 Required)",null,null,{"$f":"SUM(F150,F156,F162)","v":0}]
[null,null,"For Conventional Scrub Head:",null,null,{"$f":"SUM(F151:F154)","v":0}]
[null,null,"Polypropylene Brush",1016811,248,null,{"$f":"F151*E151","v":0}]
[null,null,"Nylon Brush",1016810,276,null,{"$f":"F152*E152","v":0}]
[null,null,"Abrasive Brush",1016805,455,null,{"$f":"F153*E153","v":0}]
[null,null,"Pad Driver",1212960,245,null,{"$f":"F154*E154","v":0}]
[]
[null,null,"For Insta-Click™ Scrub Head:",null,null,{"$f":"F162=SUM(F157:F160)","v":true}]
[null,null,"Polypropylene Brush",1213032,248,null,{"$f":"F157*E157","v":0}]
[null,null,"Nylon Brush",1210386,276,null,{"$f":"F158*E158","v":0}]
[null,null,"Abrasive Brush",1213033,483,null,{"$f":"F159*E159","v":0}]
[null,null,"Pad Driver",1209197,317,null,{"$f":"F160*E160","v":0}]
[]
[null,null,"Pads ",null,null,{"$f":"SUM(F163:F168)","v":0}]
[null,null,"Brown Stripping - 3M",17263,25.5,null,{"$f":"F163*E163","v":0}]
[null,null,"Blue Scrubbing - 3M",17262,25.5,null,0]
[null,null,"Red Cleaning - 3M",17261,25.5,null,0]
[null,null,"White Polishing - 3M",17260,25.5,null,0]
[null,null,"Black Stripping-Hi Pro - 3M",370094,28.5,null,0]
[null,null,"Maroon Surface Prep - 3M",1051030,30,null,0]
[]
[null,null,"500 mm/20\" Dual Cylindrical (2 Required)",null,null,{"$f":"SUM(F171:F172)","v":0}]
[null,null,"Polypropylene Brush",1212762,121,null,{"$f":"F171*E171","v":0}]
[null,null,"Nylon Brush",1209188,199,null,{"$f":"F172*E172","v":0}]
[]
[null,null,"500mm/20\" Orbital (Standard)",null,null,{"$f":"SUM(F175:F180)","v":0}]
[null,null,"Pad Driver",null,"N/C",null,{"$f":"IF(F175=0,\" \",\"N/C\")","v":" "}]
[null,null,"Pads ",null,null,{"$f":"SUM(F177:F180)","v":0}]
[null,null,"Blue Scrubbing - 3M",1205514,25,null,{"$f":"F177*E177","v":0}]
[null,null,"Red Cleaning - 3M",1205513,25,null,{"$f":"F178*E178","v":0}]
[null,null,"White Polishing - 3M",1205512,25,null,{"$f":"F179*E179","v":0}]
[null,null,"Maroon Surface Prep - 3M",1205515,62.1,null,{"$f":"F180*E180","v":0}]
[]
[null,null,"600mm/24\" Disk (2 Required)",null,null,{"$f":"SUM(F183,F189,F195)","v":0}]
[null,null,"For Conventional Scrub Head:",null,null,{"$f":"SUM(F184:F187)","v":0}]
[null,null,"Polypropylene Brush",1056313,175,null,{"$f":"F184*E184","v":0}]
[null,null,"Nylon Brush",1056306,224,null,{"$f":"F185*E185","v":0}]
[null,null,"Abrasive Brush",1063297,290,null,{"$f":"F186*E186","v":0}]
[null,null,"Pad Driver",1213038,203,null,{"$f":"F187*E187","v":0}]
[]
[null,null,"For Insta-Click™ Scrub Head:",null,null,{"$f":"SUM(F190:F201)","v":0}]
[null,null,"Polypropylene Brush",1213040,176,null,{"$f":"F190*E190","v":0}]
[null,null,"Nylon Brush",1210136,224,null,{"$f":"F191*E191","v":0}]
[null,null,"Abrasive Brush",1213041,371,null,{"$f":"F192*E192","v":0}]
[null,null,"Pad Driver",1209160,203,null,{"$f":"F193*E193","v":0}]
[]
[null,null,"Pads ",null,null,{"$f":"SUM(F196:F201)","v":0}]
[null,null,"Brown Stripping - 3M",385943,13.5,null,{"$f":"F196*E196","v":0}]
[null,null,"Blue Scrubbing - 3M",385942,13.5,null,0]
[null,null,"Red Cleaning - 3M",385941,13.5,null,0]
[null,null,"White Polishing - 3M",385940,13.5,null,0]
[null,null,"Black Stripping-Hi Pro - 3M",1063334,16.600000000000001,null,0]
[null,null,"Maroon Surface Prep - 3M",1051020,16.8,null,0]
[]
[null,"Support  (Note 7)",null,"Reference Number","Price",{"$f":"SUM(F204:F212)","v":0}]
[null,null,"T300e Operator Manual  - English",9014506,"N/C",null,{"$f":"IF(F204=0,\" \",\"N/C\")","v":" "}]
[null,null,"T300e Operator Manual  - Spanish",9014507,"N/C",null,{"$f":"IF(F205=0,\" \",\"N/C\")","v":" "}]
[null,null,"T300e Operator Manual -  French  (Note 8)",9014508,"N/C",null,{"$f":"IF(F206=0,\" \",\"N/C\")","v":" "}]
[null,null,"Additional Operator Manual","SEE ABOVE",55,null,{"$f":"F207*E207","v":0}]
[null,null,"T300e Parts Manual (Factory installed)",9014500,14,null,{"$f":"F208*E208","v":0}]
[null,null,"Additional T300e Parts Manual (After machine delivery)",9014500,54,null,{"$f":"F209*E209","v":0}]
[null,null,"Service Manual",9014510,"N/C",null,{"$f":"IF(F210=0,\" \",\"N/C\")","v":" "}]
[]
[null,null,"Packaging","Reference Number","Price",{"$f":"SUM(F213:F213)","v":0}]
[null,null,"Skid w/Carton, Stackable ",9013859,"N/C",null,{"$f":"IF(F213=0,\" \",\"N/C\")","v":" "}]
[]
[null,"AFTERMARKET ITEMS (ordered separately) :",null,null,null,{"$f":"SUM(F217)","v":0}]
[]
[null,"Brushes and Pads (Replacements)",null,"Reference Number","Price",{"$f":"SUM(F218:F219,F225,F240:F241,F247,F262,F266:F267,F276:F277,F283)","v":0}]
[null,null,"430mm/17\" Disk (1 Required)",null,null,{"$f":"SUM(F219,F225,F231)","v":0}]
[null,null,"For Conventional Scrub Head:",null,null,{"$f":"SUM(F220:F223)","v":0}]
[null,null,"Polypropylene Brush",1016765,214.2,null,{"$f":"F220*E220","v":0}]
[null,null,"Nylon Brush",1016764,264.60000000000002,null,{"$f":"F221*E221","v":0}]
[null,null,"Abrasive Brush",1016763,354.2,null,{"$f":"F222*E222","v":0}]
[null,null,"Pad Driver",1212965,210,null,{"$f":"F223*E223","v":0}]
[]
[null,null,"For Insta-Click™ Scrub Head:",null,null,{"$f":"SUM(F226:F238)","v":0}]
[null,null,"Polypropylene Brush",1213035,280,null,{"$f":"F226*E226","v":0}]
[null,null,"Nylon Brush",1213034,341.6,null,{"$f":"F227*E227","v":0}]
[null,null,"Abrasive Brush",1213037,454.9,null,{"$f":"F228*E228","v":0}]
[null,null,"Pad Driver",1211869,301,null,{"$f":"F229*E229","v":0}]
[]
[null,null,"Pads",null,null,{"$f":"SUM(F232:F238)","v":0}]
[null,null,"Brown Stripping - 3M",1050267,19.600000000000001,null,{"$f":"F232*E232","v":0}]
[null,null,"Blue Scrubbing - 3M",1050270,19.600000000000001,null,0]
[null,null,"Red Cleaning - 3M",1050271,19.600000000000001,null,0]
[null,null,"White Polishing - 3M",1050273,19.600000000000001,null,0]
[null,null,"Black Stripping-Hi Pro - 3M",1050262,27.6,null,0]
[null,null,"Maroon Surface Prep - 3M",1051028,26.8,null,0]
[null,null,"Purple Polishing - 3M  (Case of 5 Pads)",1073766,478.79999999999995,null,0]
[]
[null,null,"500mm/20\" Disk (1 Required)",null,null,{"$f":"SUM(F241,F247,F253)","v":0}]
[null,null,"For Conventional Scrub Head:",null,null,{"$f":"SUM(F242:F245)","v":0}]
[null,null,"Polypropylene Brush",1016811,247.8,null,{"$f":"F242*E242","v":0}]
[null,null,"Nylon Brush",1016810,275.8,null,{"$f":"F243*E243","v":0}]
[null,null,"Abrasive Brush",1016805,455,null,{"$f":"F244*E244","v":0}]
[null,null,"Pad Driver",1212960,245,null,{"$f":"F245*E245","v":0}]
[]
[null,null,"For Insta-Click™ Scrub Head:",null,null,{"$f":"SUM(F248:F260)","v":0}]
[null,null,"Polypropylene Brush",1213032,339.8,null,{"$f":"F248*E248","v":0}]
[null,null,"Nylon Brush",1210386,357,null,{"$f":"F249*E249","v":0}]
[null,null,"Abrasive Brush",1213033,589.70000000000005,null,{"$f":"F250*E250","v":0}]
[null,null,"Pad Driver",1209197,322.3,null,{"$f":"F251*E251","v":0}]
[]
[null,null,"Pads ",null,null,{"$f":"SUM(F254:F260)","v":0}]
[null,null,"Brown Stripping - 3M",17263,25.5,null,{"$f":"F254*E254","v":0}]
[null,null,"Blue Scrubbing - 3M",17262,25.5,null,0]
[null,null,"Red Cleaning - 3M",17261,25.5,null,0]
[null,null,"White Polishing - 3M",17260,25.5,null,0]
[null,null,"Black Stripping-Hi Pro - 3M",370094,28.5,null,0]
[null,null,"Maroon Surface Prep - 3M",1051030,30,null,0]
[null,null,"Purple Polishing - 3M  (Case of 5 Pads)",1073751,540.9,null,0]
[]
[null,null,"500 mm/20\" Dual Cylindrical (2 Required)",null,null,{"$f":"SUM(F263:F264)","v":0}]
[null,null,"Polypropylene Brush",1212762,162.19999999999999,null,{"$f":"F263*E263","v":0}]
[null,null,"Nylon Brush",1209188,267.60000000000002,null,{"$f":"F264*E264","v":0}]
[]
[null,null,"500mm/20\" Orbital (Standard)",null,null,{"$f":"SUM(F267)","v":0}]
[null,null,"Pads (Price is for 1 pad, must order a case of 10)",null,null,{"$f":"SUM(F268:F274)","v":0}]
[null,null,"Blue Scrubbing - 3M",1205514,25,null,{"$f":"F268*E268","v":0}]
[null,null,"Red Cleaning - 3M",1205513,25,null,0]
[null,null,"White Polishing - 3M",1205512,25,null,0]
[null,null,"Maroon Surface Prep - 3M",1205515,62.1,null,0]
[null,null,"Red Backer Pad with (2) Strips of Velcro",9010674,86.6,null,0]
[null,null,"Purple Polishing - 3M  (Case of 5 Pads)",1073757,640.4,null,0]
[null,null,"Green Turf Pads (Case of 4 Pads)",1074740,378,null,{"$f":"F274*E274","v":0}]
[]
[null,null,"600mm/24\" Disk (2 Required)",null,null,{"$f":"SUM(F277,F283,F289)","v":0}]
[null,null,"For Conventional Scrub Head:",null,null,{"$f":"SUM(F278:F281)","v":0}]
[null,null,"Polypropylene Brush",1056313,175.6,null,{"$f":"F278*E278","v":0}]
[null,null,"Nylon Brush",1056306,223.9,null,{"$f":"F279*E279","v":0}]
[null,null,"Abrasive Brush",1063297,290,null,{"$f":"F280*E280","v":0}]
[null,null,"Pad Driver",1213038,203.6,null,{"$f":"F281*E281","v":0}]
[]
[null,null,"For Insta-Click™ Scrub Head:",null,null,{"$f":"SUM(F284:F296)","v":0}]
[null,null,"Polypropylene Brush",1213040,231.3,null,{"$f":"F284*E284","v":0}]
[null,null,"Nylon Brush",1210136,297,null,{"$f":"F285*E285","v":0}]
[null,null,"Abrasive Brush",1213041,371,null,{"$f":"F286*E286","v":0}]
[null,null,"Pad Driver",1209160,266.7,null,{"$f":"F287*E287","v":0}]
[]
[null,null,"Pads ",null,null,{"$f":"SUM(F290:F296)","v":0}]
[null,null,"Brown Stripping - 3M",385943,13.5,null,{"$f":"F290*E290","v":0}]
[null,null,"Blue Scrubbing - 3M",385942,13.5,null,0]
[null,null,"Red Cleaning - 3M",385941,13.5,null,0]
[null,null,"White Polishing - 3M",385940,13.5,null,0]
[null,null,"Black Stripping-Hi Pro - 3M",1063334,16.600000000000001,null,0]
[null,null,"Maroon Surface Prep - 3M",1051020,16.8,null,0]
[null,null,"Purple Polishing - 3M  (Case of 5 Pads)",1073747,315.89999999999998,null,0]
[]
[null,"Maintenance Items",null,"Reference Number","Price",{"$f":"SUM(F299:F313)","v":0}]
[null,null,"13A 85-265V AC 50/60Hz 1Ph - On Board",1202261,566.29999999999995,null,{"$f":"F299*E299","v":0}]
[null,null,"13A 85-265V AC 50/60Hz 1Ph - Off Board",1212837,441,null,0]
[null,null,"Squeegee Blade Front, Linatex - Standard",1203954,17.100000000000001,null,0]
[null,null,"Squeegee Blade Rear, Linatex - Standard",1203953,18.899999999999999,null,0]
[null,null,"Squeegee Blade Front, Gum Rubber",1215612,10.5,null,0]
[null,null,"Squeegee Blade Rear, Gum Rubber",1215610,19.600000000000001,null,0]
[null,null,"Squeegee Blade Front, Urethane",1215611,41.1,null,0]
[null,null,"Squeegee Blade Rear, Urethane",1215609,59.3,null,0]
[null,null,"PVC material recovery hose",1211220,22.9,null,0]
[null,null,"PVC material drain hose with drain cap",1213010,31.5,null,0]
[null,null,"Polyurethane material recovery hose",1204663,36,null,0]
[null,null,"Polyurethane material drain hose with drain cap",1213008,43.4,null,0]
[null,null,"Polyurethane material drain hose with drain control valve",9014171,258,null,0]
[null,null,"Debris Tray Deflector Kit",9014872,31.5,null,0]
[null,null,"ecH2O NanoClean WCM 270ML Cartridge",9013646,221.2,null,0]
[]
[]
[null,"Custom Solution--write in description, qty, price, and PN if applicable",null,null,null,{"$f":"SUM(F317)","v":0}]
[null,null,null,null,"Insert Prices Here",{"$f":"SUM(F318:F321)","v":0}]
[null,null,null,"Custom",null,{"$f":"IF(E318 <> \"\", 1, 0)","v":0},{"$f":"F318*E318","v":0}]
[null,null,null,"Custom",null,{"$f":"IF(E319 <> \"\", 1, 0)","v":0},{"$f":"F319*E319","v":0}]
[null,null,null,"Custom",null,{"$f":"IF(E320 <> \"\", 1, 0)","v":0},{"$f":"F320*E320","v":0}]
[null,null,null,"Custom",null,{"$f":"IF(E321 <> \"\", 1, 0)","v":0},{"$f":"F321*E321","v":0}]
[null,null,"Prepaid and Add","Freight",null,1,{"$f":"F322*E322","v":0}]
[null,null,"Subject to all applicable taxes","Tax",null,1,{"$f":"F323*E323","v":0}]
[]
[null,null,null,"MACHINE TOTAL*",null,null,{"$f":"SUM(G55:G323)","v":0},null,null,null,null,null,null,"This goes to \"My Documents\""]
[null,null,null,null,null,null,{"$f":"SUM(G325)","v":0}]
[]
[null,null,"National Leasing - Leasing Calculation Option:","Finance Option 1",null,"Finance Option 2",null,null,{"$f":"Financing!A38","v":"Rates 2016 - Rev. 7/1/2016"}]
[null,null,"Purchase Option:",1,null,"FMV Scrubber",null,null,{"$f":"Financing!A39","v":"“Blank Payment Amounts Indicate The Financing Option Or Purchase Options Selected Are Not "}]
[null,null,"24 Months",0,null,0,null,null,{"$f":"Financing!A40","v":"Applicable Or The Machine Total Is Below The Minimum Amount For The Selected Vendor”"}]
[null,null,"36 Months",0,null,0,null,null,{"$f":"Financing!A41","v":"\"Quoted monthly payments are estimates only and are based on a certain level of credit rating."}]
[null,null,"48 Months",0,null,0,null,null,{"$f":"Financing!A42","v":"Actual monthly payments may be higher depending on your credit rating.\""}]
[null,null,"60 Months",0,null,0,null,null,{"$f":"Financing!A43","v":"“Financing rates do not include Pre-Paid Service”"}]
[null,"   TennantTrue",null,null,0,0]
[]
[null,null,"Is customer interested in service program?","Yes","*State/County selection required for TennantTrue service options"]
[]
[null,null,"If not, why?"]
[]
[null,null,"Term:",36,null,null,"AB Brushes","No"]
[null,null,"Monthly machine usage (hrs):",25]
[]
[null,null,"TennantTrue: ","Rate Per Unit",null,"Hourly Labor Rate",null,"Site Visit Charge"]
[null,null,"Gold - Monthly",70]
[null,null,"Gold - Pre Pay Full Term",2344]
[null,null,"Silver - Monthly",50]
[null,null,"Silver - Annually",592]
[null,null,"Silver - Pre Pay Full Term",1737]
[null,null,"Silver - Per Visit",310]
[null,null,"Pay As You Go",null,null,null,null,null,null,null,"*State/County selection required for 'Pay As You Go' and 'On Demand'."]
[null,null,"On Demand"]
[]
[]
[]
[null,"Quote Special Instructions:"]
[]
[]
[null,{"$f":"Start_Here!E33","v":"Terms and Conditions"}]
[null,{"$f":"Start_Here!E34","v":"Ask your local sales rep for estimated lead times. Verify when placing order"}]
[null,{"$f":"Start_Here!E35","v":"All orders subject to acceptance by Tennant Sales and Service Company, Minneapolis, Minnesota"}]
[null,{"$f":"Start_Here!E36","v":"Prices subject to change without notice. Subject to any applicable taxes."}]
[null,{"$f":"Start_Here!E37","v":"Terms:  Net 30 days.  Payable in Canadian Funds"}]
[null,{"$f":"Start_Here!E38","v":"Freight:  Accessories, parts, supplies, detergents, and floor coatings orders delivered DDP "}]
[null,{"$f":"Start_Here!E39","v":"shipping point Frt PPD.  Machine orders delivered DDP shipping point Frt PPD and add."}]
[null,{"$f":"Start_Here!E40","v":"Returned Merchandise is subject to a restocking fee."}]
[null,{"$f":"Start_Here!E42","v":"Printed General Terms and Conditions are also available upon request."}]
[null,{"$f":"Start_Here!E43","v":0}]
[]
[]
[null,null,null,null,"Quote Date :",null,{"$f":"Letter!$A$25","v":"2014-10-02"}]
["Order Placement Information:  To place your order, fill in PO# and customer signatures,"]
["call or fax to the numbers listed below. Customer Purchase Order is required."]
["If information is missing, orders will be entered and held until all information is received."]
[null,null,"Customer Number",null,{"$f":"Start_Here!F15","v":"Cust Grp 3"}]
[null,null,{"$f":"Start_Here!$F$5","v":0},null,{"$f":"Start_Here!F16","v":0}]
[null,null,{"$f":"Start_Here!$B$18","v":"Sold To Information (Please Verify)"}]
["Company",null,{"$f":"Start_Here!$C$19","v":""}]
["Address",null,{"$f":"Start_Here!$C$20","v":""}]
[null,null,{"$f":"Start_Here!$C$21","v":""}]
["Name",null,{"$f":"Start_Here!$C$22","v":""}]
["Phone",null,{"$f":"Start_Here!$C$23","v":""}]
[null,null,{"$f":"Start_Here!$B$11","v":"Ship To Information (Please Verify)"}]
["Company",null,{"$f":"Start_Here!$C$12","v":""}]
["Address",null,{"$f":"Start_Here!$C$13","v":""}]
[null,null,{"$f":"Start_Here!$C$14","v":""}]
["Name",null,{"$f":"Start_Here!$C$15","v":""}]
["Phone",null,{"$f":"Start_Here!$C$16","v":""}]
[null,null,{"$f":"Start_Here!$B$25","v":"Shipping/Carrier Instructions:"},null,"Order Special Instructions:"]
[null,null,{"$f":"Start_Here!$C$26","v":0}]
[]
[null,null," Customer Purchase Order No. "]
[null,null," (please attach copy) "]
[]
[]
[null,null," Tax Exempt ",null," Yes "]
[null,null,null,null," No "]
[null,null," If Yes, attach a copy of your exemption certificate. "]
[]
[null,null," Requested Delivery Date "]
[null,null,{"$f":"Start_Here!$F$14","v":0}]
[null,null,{"$f":"Start_Here!$F$8","v":0},null,{"$f":"Start_Here!$F$11","v":0}]
[null,null," Authorized Buyer (please print) ",null," Phone Number "]
[]
[null,null," Authorized Buyer Signature "]
[]
[null,null,"Tennant Representative"]
["Specialized Maintenance Equipment"]
[{"$f":"Start_Here!$C$45","v":"TENNANT · 701 NORTH LILAC DRIVE · P.O. BOX 1452 · MINNEAPOLIS, MN 55440-1452 ·"}]
[{"$f":"Start_Here!$C$46","v":" PHONE:800-553-8033 · FAX:763-513-2116"}]
[]
[null,"SPECIAL INFORMATION"]
[null,"Notes"]
[null,1,"Pre-Configured Machines cannot add or change options.  All units are shipped via stackable skid with carton."]
[null,null,"When ordering, provide the reference number listed above.  Price does not include freight or tax.  Availability of units "]
[null,null,"and lead time may vary."]
[]
[null,2,"Pad Assist Drive Type is only available on the 430 mm/17\" and 500 mm/20\" units."]
[null,null,"Self Propel Drive Type is available on all machine types."]
[null,null,"The Self Propel price is included in the Cleaning Type section for Dual Disk, Dual Cylindrical and Orbital machines"]
[]
[null,3,"To maximize run time, it is recommend that the Wet 150AH Batteries are ordered."]
[null,null,"Sealed/MF AGM 140AH Battery available on all units."]
[null,null,"Wet 105AH and Wet 130AH Batteries are not available on Dual Cylindrical machines."]
[]
[null,4,"Hydrolink® Battery Watering System is only available Wet 150AH lead acid batteries.  "]
[]
[null,5,"Multiple Down Pressure (Dual Down Pressure)"]
[null,null,"430 mm / 17\" Single Disk - 21, 39 kg / 47, 86 lbs"]
[null,null,"500 mm / 20\" Single Disk - 23, 41 kg / 51, 90 lbs"]
[null,null,"600 mm / 24\" Dual Disk - 26, 44 kg / 57, 97 lbs"]
[null,null,"500 mm / 20\" Dual Cylindrical - 24, 29 kg / 53, 64 lbs"]
[null,null,"500 mm / 20\" Orbital - 29, 50 kg / 63, 109 lbs"]
[]
[null,6,"One Pad Driver or Brush can be selected with 430 mm/17\" and 500 mm/20\" Models"]
[null,null,"A Set of two Pad Drivers or Brushes can be selected for 600 mm/24\" Models"]
[null,null,"Pad Driver is included in the base machine price of Orbital Models."]
[null,null,"A Set of two Cylindrical Brushes can be selected for the Dual Cylindrical Model"]
[null,null,"If Insta-Click Cleaning Tool Attachment is chosen, a Insta-Click pad driver or brush must be selected"]
[null,null,"If 3-Lug Cleaning Tool Attachment is chosen, a 3-lug pad driver or brush must be selected"]
[]
[null,7,"Additional hard copy Operator and Parts Manuals can be ordered or digital copies can be downloaded from www.Tennantco.com."]
[]
[null,8,"A French and English manual will be supplied for all units shipping into Quebec, Canada at no charge.  An additional manual"]
[null,null,"can be ordered (for a total of 3 manuals) for an additional charge as stated under 'Additional Operator Manual'."]
[]
[null,9,"Shipping Weights and Dimensions",null,"Skid w/Carton"]
[]
[null,null,"430 mm/17\" Single Model"]
[null,null,"Weight (w/105AH Battery Pad Drive)",null,"500 lbs / 227 Kg"]
[null,null,"Weight (w/130AH Battery Self Propel Drive)"]
[null,null,"Length",null,"59\" / 1500 mm"]
[null,null,"Width",null,"31\" / 787 mm"]
[null,null,"Height",null,"44\" / 1118 mm"]
[]
[null,null,"500 mm /20\" single Disk Model"]
[null,null,"Weight (w/130AH Battery Pad Drive)",null,"500 lbs / 227 Kg"]
[null,null,"Weight (w/150AH Battery Self Propel)"]
[null,null,"Length",null,"59\" / 1500 mm"]
[null,null,"Width",null,"31\" / 787 mm"]
[null,null,"Height",null,"44\" / 1118 mm"]
[]
[null,null,"600 mm/24\" Dual Disk Model"]
[null,null,"Weight (w/150AH Battery)",null,"538 lbs / 244 Kg"]
[null,null,"Length",null,"59\" / 1500 mm"]
[null,null,"Width",null,"31\" / 787 mm"]
[null,null,"Height",null,"44\" / 1118 mm"]
[]
[null,null,"500 mm/20\" Dual Cylindrical Model"]
[null,null,"Weight (w/150AH Battery)",null,"526 lbs / 239 Kg"]
[null,null,"Length",null,"59\" / 1500 mm"]
[null,null,"Width",null,"32\" / 800 mm"]
[null,null,"Height",null,"44\" / 1118 mm"]
[]
[null,null,"500 mm/20\" Orbital Model"]
[null,null,"Weight (w/150AH Battery)",null,"526 lbs / 239 Kg"]
[null,null,"Length",null,"59\" / 1500 mm"]
[null,null,"Width",null,"32\" / 800 mm"]
[null,null,"Height",null,"44\" / 1118 mm"]

{"sheet":"T5e","index":10,"n_rows":389,"n_cols":14,"rows_kept":389,"cut":false,"hidden":false,"merged":[[326,4,326,6],[330,2,330,4],[338,4,338,5],[315,2,315,5],[316,2,316,5],[317,2,317,5],[318,2,318,5],[320,2,320,5],[321,2,321,5],[322,2,322,5],[323,2,323,5],[324,2,324,5],[288,7,288,8],[293,1,293,6],[312,4,312,6],[314,2,314,5],[286,3,286,4],[286,5,286,6],[286,7,286,8],[287,3,287,4],[287,5,287,6],[287,7,287,8],[288,3,288,4],[288,5,288,6],[284,7,284,8],[285,3,285,4],[285,5,285,6],[285,7,285,8],[282,3,282,4],[282,5,282,6],[282,7,282,8],[283,3,283,4],[283,5,283,6],[283,7,283,8],[284,3,284,4],[284,5,284,6],[281,3,281,4],[281,5,281,6],[281,7,281,8],[269,3,269,4],[269,5,269,6],[270,3,270,4],[270,5,270,6],[273,4,273,8],[275,3,275,6],[277,3,277,4],[278,3,278,4],[280,3,280,4],[280,5,280,6],[280,7,280,8],[268,3,268,4],[268,5,268,6],[30,1,30,5],[31,1,31,5],[32,1,32,5],[266,3,266,4],[266,5,266,6],[267,3,267,4],[267,5,267,6],[265,3,265,4],[265,5,265,6],[49,2,49,5],[50,2,50,5],[25,1,25,2],[28,1,28,5],[29,1,29,5],[0,2,0,3],[1,2,1,3],[2,2,2,3],[3,2,3,3],[11,2,11,3]]}
["T5e",null,{"$f":"Start_Here!$C$8","v":"Contact Name"}]
[null,null,{"$f":"Start_Here!$C$5","v":"Company Name"}]
[null,null,{"$f":"Start_Here!$C$6","v":"Address"}]
[null,null,{"$f":"Start_Here!$C$7","v":"City, State Zip"}]
[null,null,{"$f":"Start_Here!$C$39","v":"Rep Name"}]
[null,null,{"$f":"Start_Here!$C$35","v":"Tennant Sales and Service Company"}]
[null,null,{"$f":"Start_Here!$C$36","v":"701 North Lilac Drive"}]
[null,null,{"$f":"Start_Here!$C$38","v":"Minneapolis, MN 55440-1452"}]
[null,null,{"$f":"Start_Here!$C$41","v":"800-553-8033"},null,"Quote Date :",null,{"$f":"Letter!$A$25","v":"2014-10-02"}]
[]
[]
[null,null,"                     BUILT-IN \"TENNANT VALUE\" INCLUDES:"]
[]
[null,"85.5 l/22.5 gal Solution Tank  & 102.6 l/27 gal Recovery Tank",null,"Parking Brake"]
[null,"Quick TrainTM Controls",null,"Adjustable Ergonomic Handle"]
[null,"Touch Panel Controls",null,"Battery Tray"]
[null,"Three selectable down pressures & solution flows",null,"Low Voltage Cut Off"]
[null,"Extremely Low Noise Levels  (≤68 dBa)",null,"Edge & Reach Under Cleaning"]
[null,"100% Recovery in 180º point turns",null,"No Tool Brush / Squegee Change"]
[null,"Automatic: Water On / Off",null,"High Traction Drive Wheels"]
[null,null,"      Brush On / Off","Cast Aluminum Squeegee Frame & Scrub Decks"]
[null,null,"      Brush Shutoff at 80% Discharge","Rugged DuramerTM Tank Construction"]
[null,"Includes StandardPad Drivers or Brushes (Select One)",null,"FaST® Equipped Models Include:"]
[null,"ec-H2O NanoCleanTM Equipped Models Include:",null,"Foam Scrubbing Technology System"]
[null,"Electrically Converted Water Technology System",null,"Two Scrubbing Modes: FaSTTM & Conventional Scrubbing"]
[null,"Two Scrubbing Modes: ec-H2O NanoCleanTM & Conventional Scrubbing",null,"On-Board  FaST-PAKTM 2L Detergent Cartridge (Select One)"]
[]
[]
[null,"TENNANT COMPANY WARRANTY"]
[null,"3 YEARS OR 2500 HOURS -PARTS"]
[null,"3 YEARS - LABOR"]
[null,"90 DAYS - TRAVEL"]
[null,"10 YEARS ON DURAMERTM TANKS"]
[]
[null,null,null,null,"                Quote Request Information"]
[null,null,null,null,null,null,"Fax (quote only)"]
[null,null,null,null,null,null,"Mail (quote,lit, specs)"]
[null,null,null,null,null,null,"Fax + Mail"]
[null,null,null,null,"                Primary Use"]
[null,null,null,null,null,null,"Inside"]
[null,null,null,null,null,null,"Outside"]
[]
[null,null,"Description","Reference #","Price Each","Qty","Extended Price"]
[null,"Pre-Configured Machines (Note 1)",null,null,"CANADA",{"$f":"SUM(F45:F48)","v":0}]
[null,null,"600mm / 24\" Disk, Conventional Scrubbing, Solid Urethane Tires, 240AH Battery, On-Board Charger","MV-T5e-0019",{"$f":"E57","v":14758},null,{"$f":"F45*E45","v":0}]
[null,null,"600mm / 24\" Disk, ec-H2O NanoClean, Solid Urethane Tires, 240AH Battery, On-Board Charger","MV-T5e-0020",{"$f":"E57+E64","v":17462},null,{"$f":"F46*E46","v":0}]
[null,null,"700mm / 28\" Disk, Conventional Scrubbing, Solid Urethane Tires, 240AH Battery, On-Board Charger","MV-T5E-0021",{"$f":"E58","v":15567},null,{"$f":"F47*E47","v":0}]
[null,null,"700mm / 28\" Disk, ec-H2O NanoClean, Solid Urethane Tires, 240AH Battery, On-Board Charger","MV-T5E-0022",{"$f":"E58+E64","v":18271},null,{"$f":"F48*E48","v":0}]
[]
[null,null,"Above unit(s) include Pad Drivers, Standard Width Squeegee with Linatex blades, and both an English and French Operator Manual."]
[null,null,"All Pre-Configured Machines are packaged in a Skid w/Carton for shipment via LTL carriers.  No additional options can be added or changed."]
[]
[]
[null,"Base Configuration",null,null,"CANADA",{"$f":"SUM(F55,F62,F66,F70,F77)","v":0}]
[null,null,"Cleaning Type",null,null,{"$f":"SUM(F56:F60)","v":0}]
[null,null,"T5e Walk-Behind Scrubber 600 mm/24\" - Disk","T5e-600-D",13621,null,{"$f":"F56*E56","v":0},null,null,null,null,{"$f":"SUM(F56)","v":0},"Surcharge Qty"]
[null,null,"T5e Walk-Behind Scrubber 700 mm/28\" - Disk","T5e-700-D",14758,null,{"$f":"F57*E57","v":0},null,null,null,null,{"$f":"SUM(F57)","v":0},"Surcharge Qty"]
[null,null,"T5e Walk-Behind Scrubber 800 mm/32\" - Disk","T5e-800-D",15567,null,{"$f":"F58*E58","v":0},null,null,null,null,0,"Surcharge Qty"]
[null,null,"T5e Walk-Behind Scrubber 650 mm/26\" - Cylindrical","T5e-650-C",15242,null,{"$f":"F59*E59","v":0},null,null,null,null,0,"Surcharge Qty"]
[null,null,"T5e Walk-Behind Scrubber 800 mm/32\" - Cylindrical","T5e-800-C",17188,null,{"$f":"F60*E60","v":0},null,null,null,null,0,"Surcharge Qty"]
[null,null,null,null,null,null,null,null,null,null,null,0,"Surcharge Qty"]
[null,null,"Cleaning Technology: (conventional is standard,  ec-H2O NanoClean or FaST: can also operate in conventional mode)",null,null,{"$f":"SUM(F63:F64)","v":0},null,null,null,null,null,0,"Surcharge Qty"]
[null,null,"ec-H2O NanoClean™","ec-H2ONC-T5e",2940,null,{"$f":"F63*E63","v":0},null,null,null,null,0,"Surcharge Qty"]
[null,null,"FaST® ","FaST-T5e",2704,null,{"$f":"F64*E64","v":0},null,null,null,null,{"$f":"SUM(F64)","v":0},"Surcharge Qty"]
[]
[null,null,"Squeegee Width (Note 2)",null,null,{"$f":"SUM(F67:F68)","v":0}]
[null,null,"Standard","STD-T5e","N/C",null,{"$f":"IF(F67=0,\" \",\"N/C\")","v":" "}]
[null,null,"Narrow Aisle","NR-T5e","N/C",null,{"$f":"IF(F68=0,\" \",\"N/C\")","v":" "}]
[]
[null,null,"Battery Type",null,null,{"$f":"SUM(F71:F75)","v":0}]
[null,null,"Wet 240AH C/20  (Kit of 4 batteries)",9001585,"N/C",null,{"$f":"IF(F71=0,\" \",\"N/C\")","v":" "}]
[null,null,"Sealed/MF AGM 200AH C/20  (Kit of 4 batteries)",9001586,1024,null,{"$f":"F72*E72","v":0}]
[null,null,"Without Battery ",null,-611,null,{"$f":"F73*E73","v":0}]
[]
[null,null,"HydroLink® Battery Watering System  (Note 3)",9009619,513,null,{"$f":"F75*E75","v":0}]
[]
[null,null,"Charger","Reference Number",null,{"$f":"SUM(F78:F80)","v":0}]
[null,null,"19A 110-240V AC 50/60Hz 1Ph - off board",1029256,"N/C",null,{"$f":"IF(F78=0,\" \",\"N/C\")","v":" "}]
[null,null,"20A 85-130V AC 50/60Hz 1 Ph - on board",9005737,"N/C",null,{"$f":"IF(F79=0,\" \",\"N/C\")","v":" "}]
[null,null,"Without Charger",null,-611,null,{"$f":"F80*E80","v":0}]
[]
[null,"Cleaning Performance",null,"Reference Number",null,{"$f":"SUM(F83:F86)","v":0}]
[null,null,"Power Wand w/Prep Kit (Includes wand, brushes and hoses.  See note 4)","9002407 / 9001758",1704,null,{"$f":"F83*E83","v":0}]
[null,null,"Power Wand Prep Kit (Pump Only) (See note4)",9001758,495,null,{"$f":"F84*E84","v":0}]
[]
[null,null,"FaST ® Detergent (Note 5)",null,null,{"$f":"SUM(F87:F89)","v":0}]
[null,null,"FaST®  365 (2L) - Neutral Cleaner",1017015,"N/C",null,{"$f":"IF(F87=0,\" \",\"N/C\")","v":" "}]
[null,null,"FaST®  665 (2L) - Degreaser",1017022,"N/C",null,{"$f":"IF(F88=0,\" \",\"N/C\")","v":" "}]
[null,null,"FaST®  965 (2L) - HD Degreaser",9002021,"N/C",null,{"$f":"IF(F89=0,\" \",\"N/C\")","v":" "}]
[]
[null,"Machine Protection & Safety",null,"Reference Number",null,{"$f":"SUM(F92:F96)","v":0}]
[null,null,"Emergency Stop ",9001578,168,null,{"$f":"F92*E92","v":0}]
[]
[null,null,"Tires, Gray Solid Urethane",9004906,"NC",null,{"$f":"IF(F94=0,\" \",\"N/C\")","v":" "}]
[null,null,"Tires, Gray Foam-Filled Rubber",9004908,173,null,{"$f":"F95*E95","v":0}]
[null,null,"Tires, Gray Pneumatic Rubber",9004907,173,null,{"$f":"F96*E96","v":0}]
[null,null,null,null,null,{"$f":"SUM(F98:F107)","v":0}]
[null,"Brushes and Pads (Note 6)",null,"Reference Number",null,{"$f":"SUM(F99,F111,F123,F135,F141)","v":0}]
[null,null,"60cm/24\" Disk Scrubbing Brushes/Pads (2 Required - 12\" / 30cm each)",null,null,{"$f":"SUM(F100:F109)","v":0}]
[null,null,"Polypropylene",1220204,"N/C",null,{"$f":"IF(F100=0,\" \",\"N/C\")","v":" "}]
[null,null,"Nylon",1220203,"N/C",null,{"$f":"IF(F101=0,\" \",\"N/C\")","v":" "}]
[null,null,"Super Abrasive ",1220205,317,null,{"$f":"F102*E102","v":0}]
[]
[null,null,"Pad Driver",1220219,"N/C",null,{"$f":"IF(F104=0,\" \",\"N/C\")","v":" "}]
[null,null,"Pads ",null,null,{"$f":"SUM(F106:F109)","v":0}]
[null,null,"Blue Scrubbing - 3M   ",385942,13.5,null,{"$f":"F106*E106","v":0}]
[null,null,"Red Cleaning - 3M         ",385941,13.5,null,{"$f":"F107*E107","v":0}]
[null,null,"White Cleaning - 3M         ",385940,13.5,null,{"$f":"F108*E108","v":0}]
[null,null,"Maroon Surface Prep - 3M",1051020,16.8,null,{"$f":"F109*E109","v":0}]
[]
[null,null,"70cm/28\" Disk Scrubbing Brushes/Pads (2 Required - 14\" / 35cm each)",null,null,{"$f":"SUM(F112:F121)","v":0}]
[null,null,"Polypropylene",1220218,"N/C",null,{"$f":"IF(F112=0,\" \",\"N/C\")","v":" "}]
[null,null,"Nylon",1221541,"N/C",null,{"$f":"IF(F113=0,\" \",\"N/C\")","v":" "}]
[null,null,"Super Abrasive ",1220217,317,null,{"$f":"F114*E114","v":0}]
[]
[null,null,"Pad Driver",1220221,"N/C",null,{"$f":"IF(F116=0,\" \",\"N/C\")","v":" "}]
[null,null,"Pads ",null,null,{"$f":"SUM(F118:F121)","v":0}]
[null,null,"Blue Scrubbing - 3M   ",222326,16.600000000000001,null,{"$f":"F118*E118","v":0}]
[null,null,"Red Cleaning - 3M         ",222325,16.600000000000001,null,{"$f":"F119*E119","v":0}]
[null,null,"White Cleaning - 3M         ",222324,16.600000000000001,null,{"$f":"F120*E120","v":0}]
[null,null,"Maroon Surface Prep Pad",1051026,18.700000000000003,null,{"$f":"F121*E121","v":0}]
[]
[null,null,"80cm/32\" Disk Scrubbing Brushes/Pads (2 Required - 16\" / 40cm each)",null,null,{"$f":"SUM(F124:F133)","v":0}]
[null,null,"Polypropylene",1220216,"N/C",null,{"$f":"IF(F124=0,\" \",\"N/C\")","v":" "}]
[null,null,"Nylon",1220215,"N/C",null,{"$f":"IF(F125=0,\" \",\"N/C\")","v":" "}]
[null,null,"Super Abrasive ",1220214,317,null,{"$f":"F126*E126","v":0}]
[]
[null,null,"Pad Driver",1220222,"N/C",null,{"$f":"IF(F128=0,\" \",\"N/C\")","v":" "}]
[null,null,"Pads ",null,null,{"$f":"SUM(F130:F133)","v":0}]
[null,null,"Blue Scrubbing - 3M   ","63248-2",19.600000000000001,null,{"$f":"F130*E130","v":0}]
[null,null,"Red Cleaning - 3M         ","63248-3",19.600000000000001,null,{"$f":"F131*E131","v":0}]
[null,null,"White Cleaning - 3M         ","63248-4",19.600000000000001,null,{"$f":"F132*E132","v":0}]
[null,null,"Maroon Surface Prep Pad",1051027,23.8,null,{"$f":"F133*E133","v":0}]
[]
[null,null,"65cm/26\" Cylindrical Scrubbing Brushes  (2 Required)",null,null,{"$f":"SUM(F136:F139)","v":0}]
[null,null,"Polypropylene",399252,"N/C",null,{"$f":"IF(F136=0,\" \",\"N/C\")","v":" "}]
[null,null,"Heavy Duty Polypropylene",399253,"N/C",null,{"$f":"IF(F137=0,\" \",\"N/C\")","v":" "}]
[null,null,"Nylon",399251,"N/C",null,{"$f":"IF(F138=0,\" \",\"N/C\")","v":" "}]
[null,null,"Abrasive",399254,317,null,{"$f":"F139*E139","v":0}]
[]
[null,null,"80cm/32\" Cylindrical Scrubbing Brushes  (2 Required)",null,null,{"$f":"SUM(F142:F145)","v":0}]
[null,null,"Polypropylene",222307,"N/C",null,{"$f":"IF(F142=0,\" \",\"N/C\")","v":" "}]
[null,null,"Nylon",222308,"N/C",null,{"$f":"IF(F143=0,\" \",\"N/C\")","v":" "}]
[null,null,"Heavy Duty Polypropylene",374042,"N/C",null,{"$f":"IF(F144=0,\" \",\"N/C\")","v":" "}]
[null,null,"Abrasive",222309,317,null,{"$f":"F145*E145","v":0}]
[]
[null,"Support",null,"Reference Number",null,{"$f":"SUM(F148:F155)","v":0}]
[null,null,"T5e Operator Manual (English)",9002337,"N/C",null,{"$f":"IF(F148=0,\" \",\"N/C\")","v":" "}]
[null,null,"T5e Operator Manual (Spanish)",9002338,"N/C",null,{"$f":"IF(F149=0,\" \",\"N/C\")","v":" "}]
[null,null,"T5e Operator Manual (French)",9002339,"N/C",null,{"$f":"IF(F150=0,\" \",\"N/C\")","v":" "}]
[null,null,"Additional Operator Manual","see above",134,null,{"$f":"F151*E151","v":0}]
[null,null,"T5e Parts Manual",9002335,14,null,{"$f":"F152*E152","v":0}]
[null,null,"T5e Service Manual",9002342,"N/C",null,{"$f":"IF(F153=0,\" \",\"N/C\")","v":" "}]
[]
[null,null,"Packaging",null,null,{"$f":"SUM(F156:F157)","v":0}]
[null,null,"Skid w/Carton, Stackable - Disk Machines ",9002545,"N/C",null,{"$f":"IF(F156=0,\" \",\"N/C\")","v":" "}]
[null,null,"Skid w/Carton, Stackable - Cylindrical Machines ",9002547,"N/C",null,{"$f":"IF(F157=0,\" \",\"N/C\")","v":" "}]
[]
[null,"AFTERMARKET ITEMS (ordered separately) :",null,null,null,{"$f":"SUM(F161)","v":0}]
[]
[null,"Brushes and  (Replacements)",null,"Reference Number",null,{"$f":"SUM(F162,F174,F186,F198,F204)","v":0}]
[null,null,"60cm/24\" Disk Scrubbing Brushes/Pads (2 Required - 12\" / 30cm each)",null,null,{"$f":"SUM(F163:F172)","v":0}]
[null,null,"Polypropylene",1220204,192.79999999999998,null,{"$f":"F163*E163","v":0}]
[null,null,"Nylon",1220203,255.79999999999998,null,{"$f":"F164*E164","v":0}]
[null,null,"Super Abrasive ",1220205,401,null,{"$f":"F165*E165","v":0}]
[]
[null,null,"Pad Driver",1220219,207.2,null,{"$f":"F167*E167","v":0}]
[null,null,"Pads ",null,null,{"$f":"SUM(F169:F172)","v":0}]
[null,null,"Blue Scrubbing - 3M   ",385942,13.5,null,{"$f":"F169*E169","v":0}]
[null,null,"Red Cleaning - 3M         ",385941,13.5,null,{"$f":"F170*E170","v":0}]
[null,null,"White Cleaning - 3M         ",385940,13.5,null,{"$f":"F171*E171","v":0}]
[null,null,"Maroon Surface Prep Pad",1051020,16.8,null,{"$f":"F172*E172","v":0}]
[]
[null,null,"70cm/28\" Disk Scrubbing Brushes/Pads (2 Required - 14\" / 35cm each)",null,null,{"$f":"SUM(F175:F184)","v":0}]
[null,null,"Polypropylene",1220218,218.4,null,{"$f":"F175*E175","v":0}]
[null,null,"Nylon",1221541,291.2,null,{"$f":"F176*E176","v":0}]
[null,null,"Super Abrasive ",1220217,472.3,null,{"$f":"F177*E177","v":0}]
[]
[null,null,"Pad Driver",1220221,297.3,null,{"$f":"F179*E179","v":0}]
[null,null,"Pads ",null,null,{"$f":"SUM(F181:F184)","v":0}]
[null,null,"Blue Scrubbing - 3M   ",222326,16.600000000000001,null,{"$f":"F181*E181","v":0}]
[null,null,"Red Cleaning - 3M         ",222325,16.600000000000001,null,{"$f":"F182*E182","v":0}]
[null,null,"White Cleaning - 3M         ",222324,16.600000000000001,null,{"$f":"F183*E183","v":0}]
[null,null,"Maroon Surface Prep Pad",1051026,18.700000000000003,null,{"$f":"F184*E184","v":0}]
[]
[null,null,"80cm/32\" Disk Scrubbing Brushes/Pads (2 Required - 16\" / 40cm each)",null,null,{"$f":"SUM(F187:F196)","v":0}]
[null,null,"Polypropylene",1220216,250.9,null,{"$f":"F187*E187","v":0}]
[null,null,"Nylon",1220215,338.8,null,{"$f":"F188*E188","v":0}]
[null,null,"Super Abrasive ",1220214,472.40000000000003,null,{"$f":"F189*E189","v":0}]
[]
[null,null,"Pad Driver",1220222,331,null,{"$f":"F191*E191","v":0}]
[null,null,"Pads ",null,null,{"$f":"SUM(F193:F196)","v":0}]
[null,null,"Blue Scrubbing - 3M   ","63248-2",19.600000000000001,null,{"$f":"F193*E193","v":0}]
[null,null,"Red Cleaning - 3M         ","63248-3",19.600000000000001,null,{"$f":"F194*E194","v":0}]
[null,null,"White Cleaning - 3M         ","63248-4",19.600000000000001,null,{"$f":"F195*E195","v":0}]
[null,null,"Maroon Surface Prep Pad",1051027,23.8,null,{"$f":"F196*E196","v":0}]
[]
[null,null,"65cm/26\" Cylindrical Scrubbing Brushes  (2 Required)",null,null,{"$f":"SUM(F199:F202)","v":0}]
[null,null,"Polypropylene",399252,180.9,null,{"$f":"F199*E199","v":0}]
[null,null,"Heavy Duty Polypropylene",399253,180.9,null,{"$f":"F200*E200","v":0}]
[null,null,"Nylon",399251,216.2,null,{"$f":"F201*E201","v":0}]
[null,null,"Abrasive",399254,364.3,null,{"$f":"F202*E202","v":0}]
[]
[null,null,"80cm/32\" Cylindrical Scrubbing Brushes  (2 Required)",null,null,{"$f":"SUM(F205:F208)","v":0}]
[null,null,"Polypropylene",222307,215.2,null,{"$f":"F205*E205","v":0}]
[null,null,"Heavy Duty Polypropylene",374042,213.5,null,{"$f":"F206*E206","v":0}]
[null,null,"Nylon",222308,312.70000000000005,null,{"$f":"F207*E207","v":0}]
[null,null,"Abrasive",222309,464.8,null,{"$f":"F208*E208","v":0}]
[]
[null,"Aftermarket FaST-PAK ® Detergent ",null,null,null,{"$f":"SUM(F211:F213)","v":0}]
[null,null,"FaST®  365 (2L) - Neutral Cleaner",1017015,189.7,null,{"$f":"F211*E211","v":0}]
[null,null,"FaST®  665 (2L) - Degreaser",1017022,346,null,{"$f":"F212*E212","v":0}]
[null,null,"FaST®  965 (2L) - HD Degreaser",9002021,447.6,null,{"$f":"F213*E213","v":0}]
[]
[null,"Aftermarket Maintenance Items  (Ordered separately)",null,"Reference Number",null,{"$f":"SUM(F216:F252)","v":0}]
[null,null,"Disk & Cylindrical Brush Versions",null,null,{"$f":"SUM(F217:F252)","v":0}]
[null,null,"Squeegee Blade, Linatex, Front - 60cm/24\" ",1021804,29.3,null,{"$f":"F217*E217","v":0}]
[null,null,"Squeegee Blade, Linatex, Rear - 60cm/24\" ",1021333,36.6,null,{"$f":"F218*E218","v":0}]
[null,null,"Squeegee Blade, Linatex, Front - 65/70cm - 26\"/28\"",1023327,28,null,0]
[null,null,"Squeegee Blade, Linatex, Rear - 65/70cm - 26\"/28\" ",1023329,35.5,null,0]
[null,null,"Squeegee Blade, Linatex, Front - 80cm/32\" ",1023398,32.9,null,0]
[null,null,"Squeegee Blade, Linatex, Rear - 80cm/32\" ",1023399,42.7,null,0]
[null,null,"Squeegee Blade, Urethane, Front - 60cm/24\" ",1025334,54.6,null,0]
[null,null,"Squeegee Blade, Urethane, Rear - 60cm/24\" ",1025336,74.099999999999994,null,0]
[null,null,"Squeegee Blade, Urethane, Front - 65/70cm - 26\"/28\"",1025339,58.8,null,0]
[null,null,"Squeegee Blade, Urethane, Rear - 65/70cm - 26\"/28\" ",1025341,82.399999999999991,null,0]
[null,null,"Squeegee Blade, Urethane, Front - 80cm/32\"",1025343,62.1,null,0]
[null,null,"Squeegee Blade, Urethane, Rear - 80cm/32\" ",1025346,86.8,null,0]
[null,null,"Squeegee Blade, Gum Rubber, Front - 60cm/24\" ",1025333,11.5,null,0]
[null,null,"Squeegee Blade, Gum Rubber, Rear - 60cm/24\"",1025335,16.100000000000001,null,0]
[null,null,"Squeegee Blade, Gum Rubber, Front - 65/70cm - 26\"/28\" ",1025337,11.5,null,0]
[null,null,"Squeegee Blade, Gum Rubber, Rear - 65/70cm - 26\"/28\"",1025340,16.100000000000001,null,0]
[null,null,"Squeegee Blade, Gum Rubber, Front - 80cm/32\"",1025342,14.5,null,0]
[null,null,"Squeegee Blade, Gum Rubber, Rear - 80cm/32\" ",1025344,20.200000000000003,null,0]
[null,null,"Disk Head Kit 60cm/24\" ",9003473,3798.5,null,0]
[null,null,"Disk Head Kit 70cm/28\" ",9003474,3999.8,null,0]
[null,null,"Disk Head Kit 80cm/32\" ",9003475,4036.9,null,0]
[null,null,"Cylindrical Head Kit 65cm/26\" ",9003476,6391.2000000000007,null,0]
[null,null,"Cylindrical Head Kit 60cm/32\"",9003477,6512,null,0]
[null,null,"Squeegee Roller",1010560,3.4,null,0]
[null,null,"Squeegee Caster Wheel (Order 2)",1006343,16.700000000000003,null,0]
[null,null,"Head Splash Skirt, 60cm/24\" Disk Model",9011849,200.7,null,0]
[null,null,"Head Splash Skirt, 70cm/28\" Disk Model",9011850,213.29999999999998,null,0]
[null,null,"Head Splash Skirt, 80cm/32\" Disk Model",9011851,225.6,null,0]
[null,null,"Head Splash Skirt, Cylindrical (qty=4 required)",1026292,29.900000000000002,null,0]
[null,null,"Squeegee Hose",1014026,34.200000000000003,null,0]
[null,null,"Recovery Drain Hose",1043538,100,null,0]
[null,null,"Drain Hose Cap Assembly",1008639,19.100000000000001,null,0]
[null,null,"Solution Drain Hose / Sight Gage",1023809,53.4,null,0]
[null,null,"Power Wand Pump Kit",9003399,443.8,null,0]
[null,null,"Pneumatic/ Air Filled Wheel Kit - Gray       ",9004903,393.90000000000003,null,0]
[null,null,"Foam Filled Wheel Kit - Gray     ",9004904,479.5,null,0]
[]
[null,"Custom Solution--write in description, qty, price, and PN if applicable",null,null,null,{"$f":"SUM(F255)","v":0}]
[null,null,null,null,"Insert Prices Here",{"$f":"SUM(F256:F259)","v":0}]
[null,null,null,"Custom",null,{"$f":"IF(E256 <> \"\", 1, 0)","v":0},{"$f":"F256*E256","v":0}]
[null,null,null,"Custom",null,{"$f":"IF(E257 <> \"\", 1, 0)","v":0},{"$f":"F257*E257","v":0}]
[null,null,null,"Custom",null,{"$f":"IF(E258 <> \"\", 1, 0)","v":0},{"$f":"F258*E258","v":0}]
[null,null,null,"Custom",null,{"$f":"IF(E259 <> \"\", 1, 0)","v":0},{"$f":"F259*E259","v":0}]
[null,null,"Prepaid and Add","Freight",null,1,{"$f":"F260*E260","v":0}]
[null,null,"Subject to all applicable taxes","Tax",null,1,{"$f":"F261*E261","v":0}]
[]
[null,null,null,"MACHINE TOTAL*",null,null,{"$f":"SUM(G45:G261)","v":0},null,null,null,null,null,null,"This goes to \"My Documents\""]
[null,null,null,null,null,null,{"$f":"SUM(G263)","v":0}]
[]
[null,null,"National Leasing - Leasing Calculation Option:","Finance Option 1",null,"Finance Option 2",null,null,{"$f":"Financing!A38","v":"Rates 2016 - Rev. 7/1/2016"}]
[null,null,"Purchase Option:",1,null,"FMV Scrubber",null,null,{"$f":"Financing!A39","v":"“Blank Payment Amounts Indicate The Financing Option Or Purchase Options Selected Are Not "}]
[null,null,"24 Months",0,null,0,null,null,{"$f":"Financing!A40","v":"Applicable Or The Machine Total Is Below The Minimum Amount For The Selected Vendor”"}]
[null,null,"36 Months",0,null,0,null,null,{"$f":"Financing!A41","v":"\"Quoted monthly payments are estimates only and are based on a certain level of credit rating."}]
[null,null,"48 Months",0,null,0,null,null,{"$f":"Financing!A42","v":"Actual monthly payments may be higher depending on your credit rating.\""}]
[null,null,"60 Months",0,null,0,null,null,{"$f":"Financing!A43","v":"“Financing rates do not include Pre-Paid Service”"}]
[null,"   TennantTrue",null,null,0,0]
[]
[null,null,"Is customer interested in service program?","Yes","*State/County selection required for TennantTrue service options"]
[]
[null,null,"If not, why?"]
[]
[null,null,"Term:",36,null,null,"AB Brushes","No"]
[null,null,"Monthly machine usage (hrs):",25]
[]
[null,null,"TennantTrue: ","Rate Per Unit",null,"Hourly Labor Rate",null,"Site Visit Charge"]
[null,null,"Gold - Monthly",75]
[null,null,"Gold - Pre Pay Full Term",2511]
[null,null,"Silver - Monthly",50]
[null,null,"Silver - Annually",592]
[null,null,"Silver - Pre Pay Full Term",1737]
[null,null,"Silver - Per Visit",310]
[null,null,"Pay As You Go",null,null,null,null,null,null,null,"*State/County selection required for 'Pay As You Go' and 'On Demand'."]
[null,null,"On Demand"]
[]
[]
[]
[null,"Quote Special Instructions:"]
[]
[]
[null,{"$f":"Start_Here!E33","v":"Terms and Conditions"}]
[null,{"$f":"Start_Here!E34","v":"Ask your local sales rep for estimated lead times. Verify when placing order"}]
[null,{"$f":"Start_Here!E35","v":"All orders subject to acceptance by Tennant Sales and Service Company, Minneapolis, Minnesota"}]
[null,{"$f":"Start_Here!E36","v":"Prices subject to change without notice. Subject to any applicable taxes."}]
[null,{"$f":"Start_Here!E37","v":"Terms:  Net 30 days.  Payable in Canadian Funds"}]
[null,{"$f":"Start_Here!E38","v":"Freight:  Accessories, parts, supplies, detergents, and floor coatings orders delivered DDP "}]
[null,{"$f":"Start_Here!E39","v":"shipping point Frt PPD.  Machine orders delivered DDP shipping point Frt PPD and add."}]
[null,{"$f":"Start_Here!E40","v":"Returned Merchandise is subject to a restocking fee."}]
[null,{"$f":"Start_Here!E42","v":"Printed General Terms and Conditions are also available upon request."}]
[null,{"$f":"Start_Here!E43","v":0}]
[]
[]
[null,null,null,null,"Quote Date :",null,{"$f":"Letter!$A$25","v":"2014-10-02"}]
["Order Placement Information:  To place your order, fill in PO# and customer signatures,"]
["call or fax to the numbers listed below. Customer Purchase Order is required."]
["If information is missing, orders will be entered and held until all information is received."]
[null,null,"Customer Number",null,{"$f":"Start_Here!F15","v":"Cust Grp 3"}]
[null,null,{"$f":"Start_Here!$F$5","v":0},null,{"$f":"Start_Here!F16","v":0}]
[null,null,{"$f":"Start_Here!$B$18","v":"Sold To Information (Please Verify)"}]
["Company",null,{"$f":"Start_Here!$C$19","v":""}]
["Address",null,{"$f":"Start_Here!$C$20","v":""}]
[null,null,{"$f":"Start_Here!$C$21","v":""}]
["Name",null,{"$f":"Start_Here!$C$22","v":""}]
["Phone",null,{"$f":"Start_Here!$C$23","v":""}]
[null,null,{"$f":"Start_Here!$B$11","v":"Ship To Information (Please Verify)"}]
["Company",null,{"$f":"Start_Here!$C$12","v":""}]
["Address",null,{"$f":"Start_Here!$C$13","v":""}]
[null,null,{"$f":"Start_Here!$C$14","v":""}]
["Name",null,{"$f":"Start_Here!$C$15","v":""}]
["Phone",null,{"$f":"Start_Here!$C$16","v":""}]
[null,null,{"$f":"Start_Here!$B$25","v":"Shipping/Carrier Instructions:"},null,"Order Special Instructions:"]
[null,null,{"$f":"Start_Here!$C$26","v":0}]
[]
[null,null," Customer Purchase Order No. "]
[null,null," (please attach copy) "]
[]
[]
[null,null," Tax Exempt ",null," Yes "]
[null,null,null,null," No "]
[null,null," If Yes, attach a copy of your exemption certificate. "]
[]
[null,null," Requested Delivery Date "]
[null,null,{"$f":"Start_Here!$F$14","v":0}]
[null,null,{"$f":"Start_Here!$F$8","v":0},null,{"$f":"Start_Here!$F$11","v":0}]
[null,null," Authorized Buyer (please print) ",null," Phone Number "]
[]
[null,null," Authorized Buyer Signature "]
[]
[null,null,"Tennant Representative"]
["Specialized Maintenance Equipment"]
[{"$f":"Start_Here!$C$45","v":"TENNANT · 701 NORTH LILAC DRIVE · P.O. BOX 1452 · MINNEAPOLIS, MN 55440-1452 ·"}]
[{"$f":"Start_Here!$C$46","v":" PHONE:800-553-8033 · FAX:763-513-2116"}]
[]
[null,"SPECIAL INFORMATION"]
[null,"Notes"]
[null,1,"Pre-Configured Machines cannot add or change options.  All units are shipped via stackable skid with carton."]
[null,null,"When ordering, provide the reference number listed above.  Price does not include freight or tax.  Availability of units "]
[null,null,"and lead time may vary."]
[]
[null,2,"Standard Squeegee recovers 100% of water in 180º point turns.  If customer has a narrow aisle, the machine can be"]
[null,null,"set-up for a narrow aisle squeegee.  The narrow-aisle squeegee is the squeegee that comes standard with the "]
[null,null,"next size smaller head and will not recover 100% of the solution in 180º point turns."]
[]
[null,null,"Scrub Head Size","Standard Squeegee","Narrow Aisle"]
[null,null,"600 mm / 24\" - Disk","600 mm / 24\" - 9002679","500 mm / 20\" - 9001178"]
[null,null,"650 mm / 26\" - Cylindrical","700 mm / 28\" - 9002680","600 mm / 24\" - 9002679"]
[null,null,"700 mm / 28\" - Disk","700 mm / 28\" - 9002680","600 mm / 24\" - 9002679"]
[null,null,"800 mm / 32\" - Disk or Cylindrical","800 mm / 32\" - 9002681","700 mm / 28\" - 9002680"]
[]
[null,3,"Only available on wet batteries, not sealed."]
[]
[null,4,"9001758 Power Wand Prep Kit (Pump Only) configures machine to have pump & fittings. When ordering 9002407 Off-aisle Power"]
[null,null,"Wand w/Prep Kit which includes wand, brushes & hoses, it also requires customer to order Power Wand Prep Kit (Pump Only) 9001758."]
[]
[null,5,"Only available on FaST models.  FaSTTM Floor Cleaning Concentrate FaST-PAKTM Cartridges. Proprietary super concentrated cleaners "]
[null,null,"for use on Tennant machines with FaSTTM Foam Scrubbing Technology Systems. One 2 liter FaST-PAKTM cartridge cleans one "]
[null,null,"million square feet (90,000m2).  Biodegradable. Phosphate free.  Safe for use on hard floors such as finished or  "]
[null,null,"unfinished VCT, Terrazzo,  Finished Wood, Marble, sealed or unsealed Concrete, Urethane or Epoxy coated surfaces. "]
[null,null,"One FaST-PAK comes with the machine - customer may select from either FaST 365 or 665  Detergent."]
[]
[null,6,"One set of brushes or pad drivers come standard with a T5e."]
[]
[null,7,"Pre-Paid and Monthly Packages are available for the IRIS Information Service. IRIS Module is required and NOT included in the price of the IRIS Information Service:"]
[null,null,"3 Year Pre-Paid IRIS Information Service                 $350.00"]
[null,null,"5 Year Pre-Paid IRIS Information Service                 $560.00"]
[null,null,"A monthly contract can be set up at $14 per month w/ 12 month minimum commitment."]
[null,null,"IRIS Telemetry Module only covers the price of the hardware. IRIS Telemetry requires an IRIS Telemetry Module and an IRIS Information Service Package."]
[]
[null,"8","Shipping Weights and Dimensions","Skid w/Carton"]
[]
[null,null,"Weight (w/ 240AH batteries)","750 lbs / 341 Kg"]
[null,null,"Length","68\" / 173cm"]
[null,null,"Width","55\" / 140cm"]
[null,null,"Height","52\" / 132cm"]

{"sheet":"T5","index":11,"n_rows":398,"n_cols":14,"rows_kept":398,"cut":false,"hidden":false,"merged":[[56,2,56,5],[57,2,57,5],[32,2,32,6],[33,2,33,6],[273,5,273,6],[272,5,272,6],[279,4,279,8],[286,7,286,8],[288,7,288,8],[287,5,287,6],[287,7,287,8],[320,2,320,5],[318,4,318,6],[281,3,281,6],[289,7,289,8],[290,7,290,8],[291,7,291,8],[294,7,294,8],[290,5,290,6],[293,3,293,4],[299,1,299,6],[294,5,294,6],[292,3,292,4],[292,5,292,6],[289,3,289,4],[289,5,289,6],[291,3,291,4],[292,7,292,8],[293,5,293,6],[293,7,293,8],[290,3,290,4],[288,5,288,6],[291,5,291,6],[288,3,288,4],[0,2,0,3],[1,2,1,3],[2,2,2,3],[3,2,3,3],[31,2,31,6],[11,2,11,3],[28,1,29,2],[344,4,344,5],[332,4,332,6],[321,2,321,5],[322,2,322,5],[323,2,323,5],[336,2,336,4],[330,2,330,5],[326,2,326,5],[324,2,324,5],[328,2,328,5],[329,2,329,5],[327,2,327,5],[294,3,294,4],[275,3,275,4],[271,5,271,6],[271,3,271,4],[276,3,276,4],[286,3,286,4],[286,5,286,6],[274,3,274,4],[274,5,274,6],[276,5,276,6],[272,3,272,4],[273,3,273,4],[283,3,283,4],[287,3,287,4],[275,5,275,6],[284,3,284,4]]}
["T5",null,{"$f":"Start_Here!$C$8","v":"Contact Name"}]
[null,null,{"$f":"Start_Here!$C$5","v":"Company Name"}]
[null,null,{"$f":"Start_Here!$C$6","v":"Address"}]
[null,null,{"$f":"Start_Here!$C$7","v":"City, State Zip"}]
[null,null,{"$f":"Start_Here!$C$39","v":"Rep Name"}]
[null,null,{"$f":"Start_Here!$C$35","v":"Tennant Sales and Service Company"}]
[null,null,{"$f":"Start_Here!$C$36","v":"701 North Lilac Drive"}]
[null,null,{"$f":"Start_Here!$C$38","v":"Minneapolis, MN 55440-1452"}]
[null,null,{"$f":"Start_Here!$C$41","v":"800-553-8033"},null,"Quote Date :",null,{"$f":"Letter!$A$25","v":"2014-10-02"}]
[]
[]
[null,null,"                     BUILT-IN \"TENNANT VALUE\" INCLUDES:"]
[]
[null,"Fully Cleanable Hygenic® Tanks",null,"Parking Brake"]
[null,"85.5 l/22.5 gal Solution Tank  & 102.6 l/27 gal Recovery Tank",null,"Emergency Stop Kit"]
[null,"1-STEPTM Button Memory Controls",null,"Unsurpassed Ergonomic Design"]
[null,"Quality Assurance thru QA ControlsTM settings",null,"Standard (4) 6 V 240AH Battery Pack (Optional AGM Batteries)"]
[null,"Economy Mode (extends run time up to 5.5 hours)",null,"Battery Tray"]
[null,"On Board Diagnostics",null,"On-board Charger"]
[null,"Touch Panel Controls",null,"Recovery Tank Debris Tray"]
[null,"Three selectable down pressures & solution flows",null,"Edge & Reach Under Cleaning"]
[null,"Extremely Low Noise Levels  (≤68 dBa)",null,"No Tool Brush / Squegee Change"]
[null,"100% Recovery in 180º point turns",null,"Includes StandardPad Drivers or Scrubbing Brushes (Select One)"]
[null,"Automatic: Water On / Off",null,"High Traction Drive Wheels"]
[null,null,"      Brush On / Off","Cast Aluminum Squeegee Frame & Scrub Decks"]
[null,null,"      Brush Shutoff at 80% Discharge","Rugged DuramerTM Tank Construction"]
[null,"ec-H2O NanoCleanTM Equipped Models Include:",null,"FaST® Equipped Models Include:"]
[null,"Electrically Converted Water Technology System",null,"Foam Scrubbing Technology System"]
[null,"Two Scrubbing Modes: ec-H2O NanoCleanTM & Conventional Scrubbing",null,"Two Scrubbing Modes: FaSTTM & Conventional Scrubbing"]
[null,null,null,"On-Board  FaST-PAKTM 2L Detergent Cartridge (Select One)"]
[]
[null,null,"TENNANT COMPANY WARRANTY"]
[null,null,"3 YEARS OR 2500 HOURS ON ALL COMPONENTS, 3 YEARS LABOR"]
[null,null,"90 DAYS TRAVEL, 10 YEARS ON DURAMERTM TANKS"]
[]
[]
[]
[]
[]
[]
[]
[null,null,null,null,"                Quote Request Information"]
[null,null,null,null,null,null,"Fax (quote only)"]
[null,null,null,null,null,null,"Mail (quote,lit, specs)"]
[null,null,null,null,null,null,"Fax + Mail"]
[null,null,null,null,"                Primary Use"]
[null,null,null,null,null,null,"Inside"]
[null,null,null,null,null,null,"Outside"]
[]
[null,null,"Description","Reference #","Price Each ","Qty","Extended Price"]
[null,"Pre-Configured Machines (Note 1)",null,null,"CANADA",{"$f":"SUM(F52:F55)","v":0}]
[null,null,"600mm / 24\" Disk, Conventional Scrubbing, Solid Urethane Tires, 240AH Battery, On-Board Charger","MV-T5-0056",14675,null,{"$f":"F52*E52","v":0}]
[null,null,"600mm / 24\" Disk, ec-H2O NanoClean, Solid Urethane Tires, 240AH Battery, On-Board Charger","MV-T5-0057",17615,null,{"$f":"F53*E53","v":0}]
[null,null,"700mm / 28\" Disk, Conventional Scrubbing, Solid Urethane Tires, 240AH Battery, On-Board Charger","MV-T5-0058",16460,null,{"$f":"F54*E54","v":0}]
[null,null,"700mm / 28\" Disk, ec-H2O NanoClean, Solid Urethane Tires, 240AH Battery, On-Board Charger","MV-T5-0059",19400,null,{"$f":"F55*E55","v":0}]
[]
[null,null,"Above unit(s) include Pad Drivers, Standard Width Squeegee with Linatex blades, and both an English and French Operator Manual."]
[null,null,"All Pre-Configured Machines are packaged in a Skid w/Carton for shipment via LTL carriers.  No additional options can be added or changed."]
[]
[]
[null,"Base Configuration",null,null,"CANADA",{"$f":"SUM(F62,F69,F73,F77,F84)","v":0}]
[null,null,"Cleaning Type",null,null,{"$f":"SUM(F63:F67)","v":0}]
[null,null,"T5 Walk-Behind Scrubber 600 mm/24\" - Disk","T5-600-D",14675,null,{"$f":"F63*E63","v":0},null,null,null,null,{"$f":"SUM(F63)","v":0},"Surcharge Qty"]
[null,null,"T5 Walk-Behind Scrubber 700 mm/28\" - Disk","T5-700-D",16460,null,{"$f":"F64*E64","v":0},null,null,null,null,{"$f":"SUM(F64)","v":0},"Surcharge Qty"]
[null,null,"T5 Walk-Behind Scrubber 800 mm/32\" - Disk","T5-800-D",17352,null,{"$f":"F65*E65","v":0},null,null,null,null,0,"Surcharge Qty"]
[null,null,"T5 Walk-Behind Scrubber 650 mm/26\" - Cylindrical","T5-650-C",16296,null,{"$f":"F66*E66","v":0},null,null,null,null,0,"Surcharge Qty"]
[null,null,"T5 Walk-Behind Scrubber 800 mm/32\" - Cylindrical","T5-800-C",18975,null,{"$f":"F67*E67","v":0},null,null,null,null,0,"Surcharge Qty"]
[null,null,null,null,null,null,null,null,null,null,null,0,"Surcharge Qty"]
[null,null,"Cleaning Technology: (conventional is standard,  ec-H2O NanoClean™ or FaST: can also operate in conventional mode)",null,null,{"$f":"SUM(F70:F71)","v":0},null,null,null,null,null,0,"Surcharge Qty"]
[null,null,"ec-H2O NanoClean™","ec-H2ONC-T5",2940,null,{"$f":"F70*E70","v":0},null,null,null,null,0,"Surcharge Qty"]
[null,null,"FaST® ","FaST-T5",2704,null,{"$f":"F71*E71","v":0},null,null,null,null,{"$f":"SUM(F71)","v":0},"Surcharge Qty"]
[]
[null,null,"Squeegee Width (See Note 2)",null,null,{"$f":"SUM(F74:F75)","v":0}]
[null,null,"Standard","STD-T5","N/C",null,{"$f":"IF(F74=0,\" \",\"N/C\")","v":" "}]
[null,null,"Narrow Aisle","NR-T5","N/C",null,{"$f":"IF(F75=0,\" \",\"N/C\")","v":" "}]
[]
[null,null,"Battery Type",null,null,{"$f":"SUM(F78:F82)","v":0}]
[null,null,"Wet 240AH C/20  (Kit of 4 batteries)",9001585,"N/C",null,{"$f":"IF(F78=0,\" \",\"N/C\")","v":" "}]
[null,null,"Sealed/MF AGM 200AH C/20  (Kit of 4 batteries)",9001586,1024,null,{"$f":"F79*E79","v":0}]
[null,null,"Without Battery",null,-611,null,{"$f":"F80*E80","v":0}]
[]
[null,null,"HydroLink® Battery Watering Kit  (Note 3)",9009619,513,null,{"$f":"F82*E82","v":0}]
[]
[null,null,"Charger","Reference Number",null,{"$f":"SUM(F85:F87)","v":0}]
[null,null,"19A 110-240V AC 50/60Hz 1Ph - off board",1029256,"N/C",null,{"$f":"IF(F85=0,\" \",\"N/C\")","v":" "}]
[null,null,"20A 85-130V AC 50/60Hz 1Ph – On Board",9001580,"N/C",null,{"$f":"IF(F86=0,\" \",\"N/C\")","v":" "}]
[null,null,"Without  Charger",null,-611,null,{"$f":"F87*E87","v":0}]
[]
[null,"Cleaning Performance",null,"Reference Number",null,{"$f":"SUM(F90:F93)","v":0}]
[null,null,"Power Wand w/Prep Kit (Includes wand, brushes and hoses.  See note 3)","9002407 / 9001591",1704,null,{"$f":"F90*E90","v":0}]
[null,null,"Power Wand Prep Kit (Pump Only) (See note 4)",9001591,495,null,{"$f":"F91*E91","v":0}]
[]
[null,null,"FaST ® Detergent (Note 5)",null,null,{"$f":"SUM(F94:F96)","v":0}]
[null,null,"FaST®  365 (2L) - Neutral Cleaner",1017015,"N/C",null,{"$f":"IF(F94=0,\" \",\"N/C\")","v":" "}]
[null,null,"FaST®  665 (2L) - Degreaser",1017022,"N/C",null,{"$f":"IF(F95=0,\" \",\"N/C\")","v":" "}]
[null,null,"FaST®  965 (2L) - HD Degreaser",9002021,"N/C",null,{"$f":"IF(F96=0,\" \",\"N/C\")","v":" "}]
[]
[null,"Machine Protection & Safety",null,"Reference Number",null,{"$f":"SUM(F99:F101)","v":0}]
[null,null,"Tires, Gray Solid Urethane",9004906,"N/C",null,{"$f":"IF(F99=0,\" \",\"N/C\")","v":" "}]
[null,null,"Tires, Gray Pneumatic Rubber",9004907,173,null,{"$f":"F100*E100","v":0}]
[null,null,"Tires, Gray Foam-Filled Rubber",9004908,173,null,{"$f":"F101*E101","v":0}]
[]
[null,"Brushes and Pads (Note 6)",null,"Reference Number",null,{"$f":"SUM(F104,F116,F128,F140,F146)","v":0}]
[null,null,"600mm/24\" Disk Scrubbing Brushes/Pads (2 Required - 12\" each)",null,null,{"$f":"SUM(F105:F114)","v":0}]
[null,null,"Polypropylene",1025095,"N/C",null,{"$f":"IF(F105=0,\" \",\"N/C\")","v":" "}]
[null,null,"Nylon",1025094,"N/C",null,{"$f":"IF(F106=0,\" \",\"N/C\")","v":" "}]
[null,null,"Super Abrasive ",1025096,317,null,{"$f":"F107*E107","v":0}]
[]
[null,null,"Pad Driver",385944,"N/C",null,{"$f":"IF(F109=0,\" \",\"N/C\")","v":" "}]
[null,null,"Pads ",null,null,{"$f":"SUM(F111:F114)","v":0}]
[null,null,"Blue Scrubbing - 3M   ",385942,13.5,null,{"$f":"F111*E111","v":0}]
[null,null,"Red Cleaning - 3M         ",385941,13.5,null,{"$f":"F112*E112","v":0}]
[null,null,"White Polishing - 3M         ",385940,13.5,null,{"$f":"F113*E113","v":0}]
[null,null,"Maroon Surface Prep Pad - 3M",1051020,16.8,null,{"$f":"F114*E114","v":0}]
[]
[null,null,"700mm/28\" Disk Scrubbing Brushes/Pads (2 Required - 14\" each)",null,null,{"$f":"SUM(F117:F126)","v":0}]
[null,null,"Polypropylene",399247,"N/C",null,{"$f":"IF(F117=0,\" \",\"N/C\")","v":" "}]
[null,null,"Nylon",399246,"N/C",null,{"$f":"IF(F118=0,\" \",\"N/C\")","v":" "}]
[null,null,"Super Abrasive ",399245,317,null,{"$f":"F119*E119","v":0}]
[]
[null,null,"Pad Driver",399249,"N/C",null,{"$f":"IF(F121=0,\" \",\"N/C\")","v":" "}]
[null,null,"Pads ",null,null,{"$f":"SUM(F123:F126)","v":0}]
[null,null,"Blue Scrubbing - 3M   ",222326,16.600000000000001,null,{"$f":"F123*E123","v":0}]
[null,null,"Red Cleaning - 3M         ",222325,16.600000000000001,null,{"$f":"F124*E124","v":0}]
[null,null,"White Polishing - 3M         ",222324,16.600000000000001,null,{"$f":"F125*E125","v":0}]
[null,null,"Maroon Surface Prep Pad - 3M",1051026,18.700000000000003,null,{"$f":"F126*E126","v":0}]
[]
[null,null,"800mm/32\" Disk Scrubbing Brushes/Pads (2 Required - 16\" each)",null,null,{"$f":"SUM(F129:F138)","v":0}]
[null,null,"Polypropylene",399244,"N/C",null,{"$f":"IF(F129=0,\" \",\"N/C\")","v":" "}]
[null,null,"Nylon",399243,"N/C",null,{"$f":"IF(F130=0,\" \",\"N/C\")","v":" "}]
[null,null,"Super Abrasive ",399242,317,null,{"$f":"F131*E131","v":0}]
[]
[null,null,"Pad Driver",399250,"N/C",null,{"$f":"IF(F133=0,\" \",\"N/C\")","v":" "}]
[null,null,"Pads ",null,null,{"$f":"SUM(F135:F138)","v":0}]
[null,null,"Blue Scrubbing - 3M   ","63248-2",19.600000000000001,null,{"$f":"F135*E135","v":0}]
[null,null,"Red Cleaning - 3M         ","63248-3",19.600000000000001,null,{"$f":"F136*E136","v":0}]
[null,null,"White Polishing - 3M         ","63248-4",19.600000000000001,null,{"$f":"F137*E137","v":0}]
[null,null,"Maroon Surface Prep Pad - 3M",1051027,23.8,null,{"$f":"F138*E138","v":0}]
[]
[null,null,"650mm/26\" Cylindrical Scrubbing Brushes  (2 Required)",null,null,{"$f":"SUM(F141:F144)","v":0}]
[null,null,"Polypropylene",399252,"N/C",null,{"$f":"IF(F141=0,\" \",\"N/C\")","v":" "}]
[null,null,"Heavy Duty Polypropylene",399253,"N/C",null,{"$f":"IF(F142=0,\" \",\"N/C\")","v":" "}]
[null,null,"Nylon",399251,"N/C",null,{"$f":"IF(F143=0,\" \",\"N/C\")","v":" "}]
[null,null,"Abrasive",399254,317,null,{"$f":"F144*E144","v":0}]
[]
[null,null,"800mm/32\" Cylindrical Scrubbing Brushes  (2 Required)",null,null,{"$f":"SUM(F147:F150)","v":0}]
[null,null,"Polypropylene",222307,"N/C",null,{"$f":"IF(F147=0,\" \",\"N/C\")","v":" "}]
[null,null,"Heavy Duty Polypropylene",374042,"N/C",null,{"$f":"IF(F148=0,\" \",\"N/C\")","v":" "}]
[null,null,"Nylon",222308,"N/C",null,{"$f":"IF(F149=0,\" \",\"N/C\")","v":" "}]
[null,null,"Abrasive",222309,317,null,{"$f":"F150*E150","v":0}]
[]
[null,"Support",null,"Reference Number",null,{"$f":"SUM(F153:F160)","v":0}]
[null,null,"T5 Operator Manual (English)",9002326,"N/C",null,{"$f":"IF(F153=0,\" \",\"N/C\")","v":" "}]
[null,null,"T5 Operator Manual (Spanish)",9002327,"N/C",null,{"$f":"IF(F154=0,\" \",\"N/C\")","v":" "}]
[null,null,"T5 Operator Manual (French) (Note 7)",9002328,"N/C",null,{"$f":"IF(F155=0,\" \",\"N/C\")","v":" "}]
[null,null,"Additional Operator Manual","see above",138.6,null,{"$f":"F156*E156","v":0}]
[null,null,"T5 Parts Manual",9002329,14,null,{"$f":"F157*E157","v":0}]
[null,null,"T5 Service Manual",9002333,"N/C",null,{"$f":"IF(F158=0,\" \",\"N/C\")","v":" "}]
[]
[null,null,"Packaging",null,null,{"$f":"SUM(F161:F162)","v":0}]
[null,null,"Skid w/Carton, Stackable - Disk Machines",9002544,"N/C",null,{"$f":"IF(F161=0,\" \",\"N/C\")","v":" "}]
[null,null,"Skid w/Carton, Stackable - Cylindrical Machines",9002546,"N/C",null,{"$f":"IF(F162=0,\" \",\"N/C\")","v":" "}]
[]
[null,"AFTERMARKET ITEMS (ordered separately) :",null,null,null,{"$f":"SUM(F166,F215,F220)","v":0}]
[]
[null,"Brushes and  (Replacements)",null,"Reference Number",null,{"$f":"SUM(F167,F179,F191,F203,F209)","v":0}]
[null,null,"600mm/24\" Disk Scrubbing Brushes/Pads (2 Required - 12\" each)",null,null,{"$f":"SUM(F168:F177)","v":0}]
[null,null,"Polypropylene",1025095,192.79999999999998,null,{"$f":"F168*E168","v":0}]
[null,null,"Nylon",1025094,255.79999999999998,null,{"$f":"F169*E169","v":0}]
[null,null,"Super Abrasive ",1025096,401,null,{"$f":"F170*E170","v":0}]
[]
[null,null,"Pad Driver",385944,207.2,null,{"$f":"F172*E172","v":0}]
[null,null,"Pads ",null,null,{"$f":"SUM(F174:F177)","v":0}]
[null,null,"Blue Scrubbing - 3M   ",385942,13.5,null,{"$f":"F174*E174","v":0}]
[null,null,"Red Cleaning - 3M         ",385941,13.5,null,{"$f":"F175*E175","v":0}]
[null,null,"White Polishing - 3M         ",385940,13.5,null,{"$f":"F176*E176","v":0}]
[null,null,"Maroon Surface Prep Pad - 3M",1051020,16.8,null,{"$f":"F177*E177","v":0}]
[]
[null,null,"700mm/28\" Disk Scrubbing Brushes/Pads (2 Required - 14\" each)",null,null,{"$f":"SUM(F180:F189)","v":0}]
[null,null,"Polypropylene",399247,218.4,null,{"$f":"F180*E180","v":0}]
[null,null,"Nylon",399246,291.2,null,{"$f":"F181*E181","v":0}]
[null,null,"Super Abrasive ",399245,472.3,null,{"$f":"F182*E182","v":0}]
[]
[null,null,"Pad Driver",399249,297.3,null,{"$f":"F184*E184","v":0}]
[null,null,"Pads ",null,null,{"$f":"SUM(F186:F189)","v":0}]
[null,null,"Blue Scrubbing - 3M   ",222326,16.600000000000001,null,{"$f":"F186*E186","v":0}]
[null,null,"Red Cleaning - 3M         ",222325,16.600000000000001,null,{"$f":"F187*E187","v":0}]
[null,null,"White Polishing - 3M         ",222324,16.600000000000001,null,{"$f":"F188*E188","v":0}]
[null,null,"Maroon Surface Prep Pad - 3M",1051026,18.700000000000003,null,{"$f":"F189*E189","v":0}]
[]
[null,null,"800mm/32\" Disk Scrubbing Brushes/Pads (2 Required - 16\" each)",null,null,{"$f":"SUM(F192:F201)","v":0}]
[null,null,"Polypropylene",399244,250.9,null,{"$f":"F192*E192","v":0}]
[null,null,"Nylon",399243,338.8,null,{"$f":"F193*E193","v":0}]
[null,null,"Super Abrasive ",399242,472.40000000000003,null,{"$f":"F194*E194","v":0}]
[]
[null,null,"Pad Driver",399250,331,null,{"$f":"F196*E196","v":0}]
[null,null,"Pads ",null,null,{"$f":"SUM(F198:F201)","v":0}]
[null,null,"Blue Scrubbing - 3M   ","63248-2",19.600000000000001,null,{"$f":"F198*E198","v":0}]
[null,null,"Red Cleaning - 3M         ","63248-3",19.600000000000001,null,{"$f":"F199*E199","v":0}]
[null,null,"White Polishing - 3M         ","63248-4",19.600000000000001,null,{"$f":"F200*E200","v":0}]
[null,null,"Maroon Surface Prep Pad - 3M",1051027,23.8,null,{"$f":"F201*E201","v":0}]
[]
[null,null,"650mm/26\" Cylindrical Scrubbing Brushes  (2 Required)",null,null,{"$f":"SUM(F204:F207)","v":0}]
[null,null,"Polypropylene",399252,180.9,null,{"$f":"F204*E204","v":0}]
[null,null,"Heavy Duty Polypropylene",399253,180.9,null,{"$f":"F205*E205","v":0}]
[null,null,"Nylon",399251,216.2,null,{"$f":"F206*E206","v":0}]
[null,null,"Abrasive",399254,364.3,null,{"$f":"F207*E207","v":0}]
[]
[null,null,"800mm/32\" Cylindrical Scrubbing Brushes  (2 Required)",null,null,{"$f":"SUM(F210:F213)","v":0}]
[null,null,"Polypropylene",222307,215.2,null,{"$f":"F210*E210","v":0}]
[null,null,"Heavy Duty Polypropylene",374042,213.5,null,{"$f":"F211*E211","v":0}]
[null,null,"Nylon",222308,312.70000000000005,null,{"$f":"F212*E212","v":0}]
[null,null,"Abrasive",222309,464.8,null,{"$f":"F213*E213","v":0}]
[]
[null,"Aftermarket FaST-PAK ® Detergent ",null,null,null,{"$f":"SUM(F216:F218)","v":0}]
[null,null,"FaST®  365 (2L) - Neutral Cleaner",1017015,189.7,null,{"$f":"F216*E216","v":0}]
[null,null,"FaST®  665 (2L) - Degreaser",1017022,346,null,{"$f":"F217*E217","v":0}]
[null,null,"FaST®  965 (2L) - HD Degreaser",9002021,447.6,null,{"$f":"F218*E218","v":0}]
[]
[null,"Aftermarket Maintenance Items  (Ordered separately)",null,"Reference Number","2016 Price",{"$f":"SUM(F221)","v":0}]
[null,null,"Disk & Cylindrical Brush Versions",null,null,{"$f":"SUM(F222:F258)","v":0}]
[null,null,"Squeegee Blade, Linatex, Rear - 600mm/24\" ",1021333,36.6,null,{"$f":"F222*E222","v":0}]
[null,null,"Squeegee Blade, Linatex, Front - 600mm/24\" ",1021804,29.3,null,0]
[null,null,"Squeegee Blade, Linatex, Rear - 650/700 mm  26 / 28\" ",1023329,35.5,null,0]
[null,null,"Squeegee Blade, Linatex, Front - 650/700mm   26 / 28\"",1023327,28,null,0]
[null,null,"Squeegee Blade, Linatex, Rear -800 mm/32\" ",1023399,42.7,null,0]
[null,null,"Squeegee Blade, Linatex, Front - 800mm/32\" ",1023398,32.9,null,0]
[null,null,"Squeegee Blade, Urethane, Front - 600mm/24\" ",1025334,54.6,null,0]
[null,null,"Squeegee Blade, Urethane, Rear - 600mm/24\" ",1025336,74.099999999999994,null,0]
[null,null,"Squeegee Blade, Urethane, Rear - 650/700mm   26 / 28\" ",1025341,82.399999999999991,null,0]
[null,null,"Squeegee Blade, Urethane, Front - 650/700mm   26 / 28\"",1025339,58.8,null,0]
[null,null,"Squeegee Blade, Urethane, Front - 800mm/32\"",1025343,62.1,null,0]
[null,null,"Squeegee Blade, Urethane, Rear - 800mm/32\" ",1025346,86.8,null,0]
[null,null,"Squeegee Blade, Gum Rubber, Rear - 600mm/24\"",1025335,16.100000000000001,null,0]
[null,null,"Squeegee Blade, Gum Rubber, Rear - 650/700mm   26 / 28\"",1025340,16.100000000000001,null,0]
[null,null,"Squeegee Blade, Gum Rubber, Rear - 800mm/32\" ",1025344,20.200000000000003,null,0]
[null,null,"Squeegee Blade, Gum Rubber, Front - 600mm/24\" ",1025333,11.5,null,0]
[null,null,"Squeegee Blade, Gum Rubber, Front - 650/700mm   26 / 28\" ",1025337,11.5,null,0]
[null,null,"Squeegee Blade, Gum Rubber, Front -800mm/ 32\"",1025342,14.5,null,0]
[null,null,"Disk Head Kit 600mm/24\" ",9003481,3744.9,null,0]
[null,null,"Disk Head Kit 700mm/28\" ",9003482,3819.4,null,0]
[null,null,"Disk Head Kit 800mm/32\" ",9003483,3962.5,null,0]
[null,null,"Cylindrical Head Kit 650mm/26\" ",9003484,6291.4000000000005,null,0]
[null,null,"Cylindrical Head Kit 600mm/32\"",9003485,6468.7,null,{"$f":"F244*E244","v":0}]
[null,null,"Squeegee Roller",1010560,3.4,null,0]
[null,null,"Squeegee Caster Wheel (Order 2)",1006343,16.700000000000003,null,0]
[null,null,"Head Splash Skirt, 600mm/24\" Disk Model",9011849,200.7,null,0]
[null,null,"Head Splash Skirt, 700mm/28\" Disk Model",9011850,213.29999999999998,null,0]
[null,null,"Head Splash Skirt, 800mm/32\" Disk Model",9011851,225.6,null,0]
[null,null,"Head Splash Skirt, Cylindrical (qty=4 required)",1026292,29.900000000000002,null,0]
[null,null,"Squeegee Hose",1014026,34.200000000000003,null,0]
[null,null,"Recovery Drain Hose",1043538,100,null,0]
[null,null,"Drain Hose Cap Assembly",1008639,19.100000000000001,null,{"$f":"F253*E253","v":0}]
[null,null,"Solution Drain Hose / Sight Gage",1023809,53.4,null,0]
[null,null,"Power Wand Pump Kit",9003398,614.80000000000007,null,0]
[null,null,"Pneumatic/ Air Filled Wheel Kit - Gray       ",9004903,393.90000000000003,null,0]
[null,null,"Foam Filled Wheel Kit - Gray     ",9004904,479.5,null,0]
[null,null,"HydroLink® Battery Watering Kit for 240 AH batteries only (for 24 Volt system)",9010300,314.8,null,0]
[]
[null,"Custom Solution--write in description, qty, price, and PN if applicable",null,null,null,{"$f":"SUM(F261)","v":0}]
[null,null,null,null,"Insert Prices Here",{"$f":"SUM(F262:F265)","v":0}]
[null,null,null,"Custom",null,{"$f":"IF(E262 <> \"\", 1, 0)","v":0},{"$f":"F262*E262","v":0}]
[null,null,null,"Custom",null,{"$f":"IF(E263 <> \"\", 1, 0)","v":0},{"$f":"F263*E263","v":0}]
[null,null,null,"Custom",null,{"$f":"IF(E264 <> \"\", 1, 0)","v":0},{"$f":"F264*E264","v":0}]
[null,null,null,"Custom",null,{"$f":"IF(E265 <> \"\", 1, 0)","v":0},{"$f":"F265*E265","v":0}]
[null,null,"Prepaid and Add","Freight",null,1,{"$f":"F266*E266","v":0}]
[null,null,"Subject to all applicable taxes","Tax",null,1,{"$f":"F267*E267","v":0}]
[]
[null,null,null,"MACHINE TOTAL*",null,null,{"$f":"SUM(G52:G267)","v":0},null,null,null,null,null,null,"This goes to \"My Documents\""]
[null,null,null,null,null,null,{"$f":"SUM(G269)","v":0}]
[]
[null,null,"National Leasing - Leasing Calculation Option:","Finance Option 1",null,"Finance Option 2",null,null,{"$f":"Financing!A38","v":"Rates 2016 - Rev. 7/1/2016"}]
[null,null,"Purchase Option:",1,null,"FMV Scrubber",null,null,{"$f":"Financing!A39","v":"“Blank Payment Amounts Indicate The Financing Option Or Purchase Options Selected Are Not "}]
[null,null,"24 Months",0,null,0,null,null,{"$f":"Financing!A40","v":"Applicable Or The Machine Total Is Below The Minimum Amount For The Selected Vendor”"}]
[null,null,"36 Months",0,null,0,null,null,{"$f":"Financing!A41","v":"\"Quoted monthly payments are estimates only and are based on a certain level of credit rating."}]
[null,null,"48 Months",0,null,0,null,null,{"$f":"Financing!A42","v":"Actual monthly payments may be higher depending on your credit rating.\""}]
[null,null,"60 Months",0,null,0,null,null,{"$f":"Financing!A43","v":"“Financing rates do not include Pre-Paid Service”"}]
[null,"   TennantTrue",null,null,0,0]
[]
[null,null,"Is customer interested in service program?","Yes","*State/County selection required for TennantTrue service options"]
[]
[null,null,"If not, why?"]
[]
[null,null,"Term:",36,null,null,"AB Brushes","No"]
[null,null,"Monthly machine usage (hrs):",25]
[]
[null,null,"TennantTrue: ","Rate Per Unit",null,"Hourly Labor Rate",null,"Site Visit Charge"]
[null,null,"Gold - Monthly",75]
[null,null,"Gold - Pre Pay Full Term",2511]
[null,null,"Silver - Monthly",50]
[null,null,"Silver - Annually",592]
[null,null,"Silver - Pre Pay Full Term",1737]
[null,null,"Silver - Per Visit",310]
[null,null,"Pay As You Go",null,null,null,null,null,null,null,"*State/County selection required for 'Pay As You Go' and 'On Demand'."]
[null,null,"On Demand"]
[]
[]
[]
[null,"Quote Special Instructions:"]
[]
[]
[null,{"$f":"Start_Here!E33","v":"Terms and Conditions"}]
[null,{"$f":"Start_Here!E34","v":"Ask your local sales rep for estimated lead times. Verify when placing order"}]
[null,{"$f":"Start_Here!E35","v":"All orders subject to acceptance by Tennant Sales and Service Company, Minneapolis, Minnesota"}]
[null,{"$f":"Start_Here!E36","v":"Prices subject to change without notice. Subject to any applicable taxes."}]
[null,{"$f":"Start_Here!E37","v":"Terms:  Net 30 days.  Payable in Canadian Funds"}]
[null,{"$f":"Start_Here!E38","v":"Freight:  Accessories, parts, supplies, detergents, and floor coatings orders delivered DDP "}]
[null,{"$f":"Start_Here!E39","v":"shipping point Frt PPD.  Machine orders delivered DDP shipping point Frt PPD and add."}]
[null,{"$f":"Start_Here!E40","v":"Returned Merchandise is subject to a restocking fee."}]
[null,{"$f":"Start_Here!E42","v":"Printed General Terms and Conditions are also available upon request."}]
[null,{"$f":"Start_Here!E43","v":0}]
[]
[]
[null,null,null,null,"Quote Date :",null,{"$f":"Letter!$A$25","v":"2014-10-02"}]
["Order Placement Information:  To place your order, fill in PO# and customer signatures,"]
["call or fax to the numbers listed below. Customer Purchase Order is required."]
["If information is missing, orders will be entered and held until all information is received."]
[null,null,"Customer Number",null,{"$f":"Start_Here!F15","v":"Cust Grp 3"}]
[null,null,{"$f":"Start_Here!$F$5","v":0},null,{"$f":"Start_Here!F16","v":0}]
[null,null,{"$f":"Start_Here!$B$18","v":"Sold To Information (Please Verify)"}]
["Company",null,{"$f":"Start_Here!$C$19","v":""}]
["Address",null,{"$f":"Start_Here!$C$20","v":""}]
[null,null,{"$f":"Start_Here!$C$21","v":""}]
["Name",null,{"$f":"Start_Here!$C$22","v":""}]
["Phone",null,{"$f":"Start_Here!$C$23","v":""}]
[null,null,{"$f":"Start_Here!$B$11","v":"Ship To Information (Please Verify)"}]
["Company",null,{"$f":"Start_Here!$C$12","v":""}]
["Address",null,{"$f":"Start_Here!$C$13","v":""}]
[null,null,{"$f":"Start_Here!$C$14","v":""}]
["Name",null,{"$f":"Start_Here!$C$15","v":""}]
["Phone",null,{"$f":"Start_Here!$C$16","v":""}]
[null,null,{"$f":"Start_Here!$B$25","v":"Shipping/Carrier Instructions:"},null,"Order Special Instructions:"]
[null,null,{"$f":"Start_Here!$C$26","v":0}]
[]
[null,null," Customer Purchase Order No. "]
[null,null," (please attach copy) "]
[]
[]
[null,null," Tax Exempt ",null," Yes "]
[null,null,null,null," No "]
[null,null," If Yes, attach a copy of your exemption certificate. "]
[]
[null,null," Requested Delivery Date "]
[null,null,{"$f":"Start_Here!$F$14","v":0}]
[null,null,{"$f":"Start_Here!$F$8","v":0},null,{"$f":"Start_Here!$F$11","v":0}]
[null,null," Authorized Buyer (please print) ",null," Phone Number "]
[]
[null,null," Authorized Buyer Signature "]
[]
[null,null,"Tennant Representative"]
["Specialized Maintenance Equipment"]
[{"$f":"Start_Here!$C$45","v":"TENNANT · 701 NORTH LILAC DRIVE · P.O. BOX 1452 · MINNEAPOLIS, MN 55440-1452 ·"}]
[{"$f":"Start_Here!$C$46","v":" PHONE:800-553-8033 · FAX:763-513-2116"}]
[]
[null,"SPECIAL INFORMATION"]
[null,"Notes"]
[null,1,"Pre-Configured Machines cannot add or change options.  All units are shipped via stackable skid with carton."]
[null,null,"When ordering, provide the reference number listed above.  Price does not include freight or tax.  Availability of units "]
[null,null,"and lead time may vary."]
[]
[null,2,"Standard Squeegee recovers 100% of water in 180º point turns.  If customer has a narrow aisle, the machine can be"]
[null,null,"set-up for a narrow aisle squeegee.  The narrow-aisle squeegee is the squeegee that comes standard with the "]
[null,null,"next size smaller head and will not recover 100% of the solution in 180º point turns."]
[]
[null,null,"Scrub Head Size","Standard Squeegee","Narrow Aisle"]
[null,null,"600 mm / 24\" - Disk","600 mm / 24\" - 9002679","500 mm / 20\" - 9001178"]
[null,null,"650 mm / 26\" - Cylindrical","700 mm / 28\" - 9002680","600 mm / 24\" - 9002679"]
[null,null,"700 mm / 28\" - Disk","700 mm / 28\" - 9002680","600 mm / 24\" - 9002679"]
[null,null,"800 mm / 32\" - Disk or Cylindrical","800 mm / 32\" - 9002681","700 mm / 28\" - 9002680"]
[]
[null,3,"Only available on wet batteries, not sealed."]
[]
[null,4,"9001591 Off-aisle Power Wand Pump/Prep Kit configures machine to have pump & fittings. When ordering 9002407 Off-aisle"]
[null,null,"Power Wand Kit which includes wand, brushes & hoses, it also requires customer to order Wand Pump/Prep Kit 9001591."]
[]
[null,5,"Only available on FaST models.  FaSTTM Floor Cleaning Concentrate FaST-PAKTM Cartridges. Proprietary super concentrated cleaners "]
[null,null,"for use on Tennant machines with FaSTTM Foam Scrubbing Technology Systems. One 2 liter FaST-PAKTM cartridge cleans one "]
[null,null,"million square feet (90,000m2).  Biodegradable. Phosphate free.  Safe for use on hard floors such as finished or  "]
[null,null,"unfinished VCT, Terrazzo,  Finished Wood, Marble, sealed or unsealed Concrete, Urethane or Epoxy coated surfaces. "]
[null,null,"One FaST-PAK comes with the machine - customer may select from either FaST 365, 665 or 965  Detergent."]
[]
[null,6,"One set of brushes or pad drivers come standard with a T5."]
[]
[null,7,"A French and English manual will be supplied for all units shipping into Quebec, Canada at no charge.  An additional manual"]
[null,null,"can be ordered (for a total of 3 manuals) for an additional charge as stated under 'Additional Operator Manual'."]
[]
[null,8,"Pre-Paid and Monthly Packages are available for the IRIS Information Service. IRIS Module is required and NOT included in the price of the IRIS Information Service:"]
[null,null,"3 Year Pre-Paid IRIS Information Service                 $350.00"]
[null,null,"5 Year Pre-Paid IRIS Information Service                 $560.00"]
[null,null,"A monthly contract can be set up at $14 per month w/ 12 month minimum commitment."]
[null,null,"IRIS Telemetry Module only covers the price of the hardware. IRIS Telemetry requires an IRIS Telemetry Module and an IRIS Information Service Package."]
[]
[null,9,"Shipping Weights and dimensions","Pad Wrap","Skid w/Carton"]
[null,null,null," "]
[null,null,"Weight","685 lbs / 311 Kg","750 lbs / 341 Kg"]
[null,null,"Length","60\" / 1,524mm","68\" / 1,727mm"]
[null,null,"Width","47\" / 1,194mm","55\" / 1,397mm"]
[null,null,"Height","44\" / 1,118mm","52\" / 1,321mm"]

{"sheet":"T7","index":12,"n_rows":347,"n_cols":14,"rows_kept":347,"cut":false,"hidden":false,"merged":[[250,7,250,8],[246,7,246,8],[243,3,243,4],[241,3,241,6],[235,5,235,6],[246,3,246,4],[246,5,246,6],[239,4,239,8],[235,3,235,4],[244,3,244,4],[247,5,247,6],[249,3,249,4],[247,3,247,4],[249,7,249,8],[305,4,305,5],[293,4,293,6],[282,2,282,5],[283,2,283,5],[284,2,284,5],[289,2,289,5],[290,2,290,5],[297,2,297,4],[291,2,291,5],[288,2,288,5],[287,2,287,5],[285,2,285,5],[253,5,253,6],[251,3,251,4],[250,3,250,4],[281,2,281,5],[259,1,259,6],[279,4,279,6],[251,5,251,6],[250,5,250,6],[253,3,253,4],[231,3,231,4],[233,3,233,4],[233,5,233,6],[232,3,232,4],[236,3,236,4],[232,5,232,6],[236,5,236,6],[234,3,234,4],[234,5,234,6],[0,2,0,3],[1,2,1,3],[2,2,2,3],[3,2,3,3],[27,2,27,6],[28,2,28,6],[29,2,29,6],[48,2,48,5],[49,2,49,5],[11,2,11,6],[231,5,231,6],[253,7,253,8],[254,5,254,6],[254,7,254,8],[251,7,251,8],[252,3,252,4],[252,5,252,6],[252,7,252,8],[254,3,254,4],[247,7,247,8],[248,3,248,4],[248,5,248,6],[248,7,248,8],[249,5,249,6]]}
["T7",null,{"$f":"Start_Here!$C$8","v":"Contact Name"}]
[null,null,{"$f":"Start_Here!$C$5","v":"Company Name"}]
[null,null,{"$f":"Start_Here!$C$6","v":"Address"}]
[null,null,{"$f":"Start_Here!$C$7","v":"City, State Zip"}]
[null,null,{"$f":"Start_Here!$C$39","v":"Rep Name"}]
[null,null,{"$f":"Start_Here!$C$35","v":"Tennant Sales and Service Company"}]
[null,null,{"$f":"Start_Here!$C$36","v":"701 North Lilac Drive"}]
[null,null,{"$f":"Start_Here!$C$38","v":"Minneapolis, MN 55440-1452"}]
[null,null,{"$f":"Start_Here!$C$41","v":"800-553-8033"},null,"Quote Date :",null,{"$f":"Letter!$A$25","v":"2014-10-02"}]
[]
[]
[null,null,"BUILT-IN “TENNANT VALUE” INCLUDES:"]
[null,null,"Fully Cleanable HygenicTM Tanks",null,"Unsurpassed Ergonomic Design"]
[null,null,"Extremely Low 67 dBa Noise Levels",null,"Standard 240 AH Battery Pack (Optional 360 AH)"]
[null,null,"Unmatched Solution Recovery",null,"Charger"]
[null,null,"One-Button Scrubbing Operation",null,"Edge & Reach Under Cleaning"]
[null,null,"Economy Mode (extends run time up to 4.5 hours)",null,"No Tool Brush / Squeegee Change"]
[null,null,"On Board Diagnostics",null,"Standard Scrubbing Brushes & Pad Drivers (Select One Type)"]
[null,null,"Touch Panel Controls",null,"Vacuum Fan In-Line Air Filter Cartridge"]
[null,null,"Automatic:",null,"Brush Shutoff When Idle"]
[null,null,"           Squeegee Lift",null,"Brush Shutoff at 80% Discharge"]
[null,null,"           Water Shutoff",null,"FaSTTM Equipped Models Include:"]
[null,null,"ec-H2O NanoCleanTM Equipped Models Include:",null,"Foam Scrubbing Technology System"]
[null,null,"Electrically Converted Water Technology System",null,"Two Scrubbing Modes: FaSTTM & Conventional Scrubbing"]
[null,null,"Two Scrubbing Modes: ec-H2O NanoCleanTM& Conventional Scrubbing",null,"On-Board  FaST-PAKTM 2L Detergent Cartridge (Select One)"]
[null,null,"Audio Back Up Alarm"]
[]
[null,null,"TENNANT COMPANY WARRANTY"]
[null,null,"3 YEARS OR 1500 HOURS ON ALL COMPONENTS, 3 YEARS LABOR"]
[null,null,"90 DAYS TRAVEL, 10 YEARS ON DURAMERTM TANKS"]
[]
[]
[]
[null,null,null,null,"                Quote Request Information"]
[null,null,null,null,null,null,"Fax (quote only)"]
[null,null,null,null,null,null,"Mail (quote,lit, specs)"]
[null,null,null,null,null,null,"Fax + Mail"]
[null,null,null,null,"                Primary Use"]
[null,null,null,null,null,null,"Inside"]
[null,null,null,null,null,null,"Outside"]
[]
[null,null,"Description","Reference #","Price Each","Qty","Extended Price"]
[null,"Pre-Configured Machines (Note 1)",null,null,null,{"$f":"SUM(F44:F47)","v":0}]
[null,null,"T7 - 650mm / 26\" Disk, Conventional Scrubbing, 240AH Battery, Off-Board Charger","MV-T7-0047",21894,null,{"$f":"F44*E44","v":0}]
[null,null,"T7 - 650mm / 26\" Disk, ec-H2O NanoClean, 240AH Battery, Off-Board Charger","MV-T7-0048",24981,null,{"$f":"F45*E45","v":0}]
[null,null,"T7 - 650mm / 26\" Disk, Conventional Scrubbing, 220AH AGM Battery, Off-Board Charger","MV-T7-0049",23429,null,{"$f":"F46*E46","v":0}]
[null,null,"T7 - 650mm / 26\" Disk, ec-H2O NanoClean, 220AH AGM Battery, Off-Board Charger","MV-T7-0050",26516,null,{"$f":"F47*E47","v":0}]
[]
[null,null,"Above unit(s) include Pad Drivers and both an English and French Operator Manual."]
[null,null,"All Pre-Configured Machines are packaged in a Skid w/Carton for shipment via LTL carriers.  No additional options can be added or changed."]
[]
[null,"Base Configuration",null,null,"CANADA",{"$f":"SUM(F53,F59,F63,F72)","v":0}]
[null,null,"Cleaning Type",null,null,{"$f":"SUM(F54:F57)","v":0}]
[null,null,"T7 Ride-On Scrubber 650 mm/26\"  - Disk","T7-650-D",21894,null,{"$f":"F54*E54","v":0},null,null,null,null,{"$f":"SUM(F54)","v":0},"Surcharge Qty"]
[null,null,"T7 Ride-On Scrubber 800 mm/32\"  - Disk","T7-800-D",23515,null,{"$f":"F55*E55","v":0},null,null,null,null,{"$f":"SUM(F55)","v":0},"Surcharge Qty"]
[null,null,"T7 Ride-On Scrubber 700mm/28\" - Cylindrical","T7-700-C",23515,null,{"$f":"F56*E56","v":0}]
[null,null,"T7 Ride-On Scrubber 800mm/32\"  - Cylindrical","T7-800-C",25136,null,{"$f":"F57*E57","v":0},null,null,null,null,0,"Surcharge Qty"]
[null,null,null,null,null,null,null,null,null,null,null,0,"Surcharge Qty"]
[null,null,"Cleaning Technology: (conventional is standard,  ec-H2O NanoClean or FaST: can also operate in conventional mode)",null,null,{"$f":"SUM(F60:F61)","v":0}]
[null,null,"ec-H2O NanoClean™","ec-H2ONC-T7",3087,null,{"$f":"F60*E60","v":0}]
[null,null,"FaST® ","FaST-T7",2704,null,{"$f":"F61*E61","v":0},null,null,null,null,0,"Surcharge Qty"]
[null,null,null,null,null,null,null,null,null,null,null,0,"Surcharge Qty"]
[null,null,"Battery Type",null,null,{"$f":"SUM(F64:F70)","v":0}]
[null,null,"Wet 240AH C/20  (Kit of 4 batteries)",9000814,"N/C",null,{"$f":"IF(F64=0,\" \",\"N/C\")","v":" "},null,null,null,null,{"$f":"SUM(F64)","v":0},"Surcharge Qty"]
[null,null,"Wet 360AH C/20  (Kit of 4 batteries)",9000815,597,null,{"$f":"F65*E65","v":0},null,null,null,null,{"$f":"SUM(F65)","v":0},"Surcharge Qty"]
[null,null,"Sealed/MF Gel 180AH C/20  (Kit of 4 batteries)",9001914,1024,null,{"$f":"F66*E66","v":0}]
[null,null,"Sealed/MF AGM 220AH C/20  (Kit of 4 batteries)",9001915,1535,null,{"$f":"F67*E67","v":0}]
[null,null,"Without Battery  ",null,-609,null,{"$f":"F68*E68","v":0}]
[]
[null,null,"HydroLink® Battery Watering Kit  (Note 2)",9009619,513,null,{"$f":"F70*E70","v":0}]
[]
[null,null,"Charger","Reference Number",null,{"$f":"SUM(F73:F78)","v":0}]
[null,null,"19A 100-240V AC 50/60Hz 1Ph - standard Off-Board for 240AH and 360AH Batteries",1029256,"N/C",null,{"$f":"IF(F73=0,\" \",\"N/C\")","v":" "}]
[null,null,"19A 100-240V AC 50/60Hz 1Ph - standard Off-Board for Gel 180AH Battery",1027951,"N/C",null,{"$f":"IF(F74=0,\" \",\"N/C\")","v":" "}]
[null,null,"25A 100-240V AC 50/60Hz 1Ph, - Off-Board for  AGM 220AH Battery",9012519,189,null,{"$f":"F75*E75","v":0}]
[null,null,"25A 100-240V AC 50/60Hz 1Ph, - Off-Board, in lieu of standard for 360AH Battery",9009486,189,null,{"$f":"F76*E76","v":0}]
[null,null,"25A 115V AC  60Hz 1Ph  - On-Board Charger, in lieu of standard",9001993,601,null,{"$f":"F77*E77","v":0}]
[null,null,"Without  Charger",null,-609,null,{"$f":"F78*E78","v":0}]
[]
[null,"Cleaning Performance",null,"Reference Number",null,{"$f":"SUM(F81)","v":0}]
[null,null,"FaST ® Detergent (Note 3)",null,null,{"$f":"SUM(F82:F84)","v":0}]
[null,null,"FaST®  365 (2L) - Neutral Cleaner",1017015,"N/C",null,{"$f":"IF(F82=0,\" \",\"N/C\")","v":" "}]
[null,null,"FaST®  665 (2L) - Degreaser",1017022,"N/C",null,{"$f":"IF(F83=0,\" \",\"N/C\")","v":" "}]
[null,null,"FaST®  965 (2L) - HD Degreaser",9002021,"N/C",null,{"$f":"IF(F84=0,\" \",\"N/C\")","v":" "}]
[]
[null,"Machine Protection & Safety",null,"Reference Number",null,{"$f":"SUM(F87:F88)","v":0}]
[null,null,"Strobe Light On Tank",9000580,651,null,{"$f":"F87*E87","v":0}]
[null,null,"Utility Basket  (Small On Board Storage)        ",1018315,301,null,{"$f":"F88*E88","v":0}]
[]
[null,"Brushes and Pads (Note 4)",null,"Reference Number",null,{"$f":"SUM(F91,F104,F118,F124)","v":0}]
[null,null,"650mm/26\" Disk Scrubbing Brushes/Pads (2 Required)",null,null,{"$f":"SUM(F92:F102)","v":0}]
[null,null,"Polypropylene",1220223,"N/C",null,{"$f":"IF(F92=0,\" \",\"N/C\")","v":" "}]
[null,null,"Nylon",1220226,"N/C",null,{"$f":"IF(F93=0,\" \",\"N/C\")","v":" "}]
[null,null,"Super Abrasive ",1220228,317,null,{"$f":"F94*E94","v":0}]
[]
[null,null,"Pad Driver",1220243,"N/C",null,{"$f":"IF(F96=0,\" \",\"N/C\")","v":" "}]
[null,null,"Pads ",null,null,{"$f":"SUM(F98:F102)","v":0}]
[null,null,"Brown Stripping - 3M     ",89046,15.2,null,{"$f":"F98*E98","v":0}]
[null,null,"Blue Scrubbing - 3M   ",89047,15.2,null,{"$f":"F99*E99","v":0}]
[null,null,"Red Cleaning - 3M         ",89048,15.2,null,{"$f":"F100*E100","v":0}]
[null,null,"White Polishing  - 3M    ",89049,15.2,null,{"$f":"F101*E101","v":0}]
[null,null,"Maroon Surface Prep Pad - 3M",1051024,17.8,null,{"$f":"F102*E102","v":0}]
[]
[null,null,"800mm/32\" Disk Scrubbing Brushes/Pads (2 Required)",null,null,{"$f":"SUM(F105:F116)","v":0}]
[null,null,"Polypropylene",1220224,"N/C",null,{"$f":"IF(F105=0,\" \",\"N/C\")","v":" "}]
[null,null,"Nylon",1220225,"N/C",null,{"$f":"IF(F106=0,\" \",\"N/C\")","v":" "}]
[null,null,"Super Abrasive ",1220227,317,null,{"$f":"F107*E107","v":0}]
[]
[null,null,"Pad Driver",1220244,"N/C",null,{"$f":"IF(F109=0,\" \",\"N/C\")","v":" "}]
[null,null,"Pads ",null,null,{"$f":"SUM(F111:F116)","v":0}]
[null,null,"Brown Stripping - 3M     ","63248-1",19.600000000000001,null,{"$f":"F111*E111","v":0}]
[null,null,"Blue Scrubbing - 3M   ","63248-2",19.600000000000001,null,0]
[null,null,"Red Cleaning - 3M         ","63248-3",19.600000000000001,null,0]
[null,null,"White Polishing  - 3M    ","63248-4",19.600000000000001,null,0]
[null,null,"Black Stripping - Hi Pro - 3M",370092,31.8,null,0]
[null,null,"Maroon Surface Prep Pad - 3M",1051027,23.8,null,0]
[]
[null,null,"700mm/28\" Cylindrical Scrubbing Brushes",null,null,{"$f":"SUM(F119:F122)","v":0}]
[null,null,"Polypropylene",222304,"N/C",null,{"$f":"IF(F119=0,\" \",\"N/C\")","v":" "}]
[null,null,"Heavy Duty Polypropylene",374041,"N/C",null,{"$f":"IF(F120=0,\" \",\"N/C\")","v":" "}]
[null,null,"Nylon",222305,"N/C",null,{"$f":"IF(F121=0,\" \",\"N/C\")","v":" "}]
[null,null,"Abrasive",222306,317,null,{"$f":"F122*E122","v":0}]
[]
[null,null,"800mm/32\" Cylindrical Scrubbing Brushes",null,null,{"$f":"SUM(F125:F128)","v":0}]
[null,null,"Polypropylene",222307,"N/C",null,{"$f":"IF(F125=0,\" \",\"N/C\")","v":" "}]
[null,null,"Heavy Duty Polypropylene",374042,"N/C",null,{"$f":"IF(F126=0,\" \",\"N/C\")","v":" "}]
[null,null,"Nylon",222308,"N/C",null,{"$f":"IF(F127=0,\" \",\"N/C\")","v":" "}]
[null,null,"Abrasive",222309,317,null,{"$f":"F128*E128","v":0}]
[]
[null,"Support",null,"Reference Number",null,{"$f":"SUM(F131:F141)","v":0}]
[null,null,"Ultimate Performance Guarantee (UPG)",50619,"N/C",null,{"$f":"IF(F131=0,\" \",\"N/C\")","v":" "}]
[null,null,"T7 Operator Manual (English)",331040,"N/C",null,{"$f":"IF(F132=0,\" \",\"N/C\")","v":" "}]
[null,null,"T7 Operator Manual (Spanish)",331042,"N/C",null,{"$f":"IF(F133=0,\" \",\"N/C\")","v":" "}]
[null,null,"T7 Operator Manual (French) (Note 5)",331043,"N/C",null,{"$f":"IF(F134=0,\" \",\"N/C\")","v":" "}]
[null,null,"Additional Operator Manual","see above",138.6,null,{"$f":"F135*E135","v":0}]
[null,null,"T7 Parts Manual",9013606,14,null,{"$f":"F136*E136","v":0}]
[null,null,"Service Manual",331045,"N/C",null,{"$f":"IF(F137=0,\" \",\"N/C\")","v":" "}]
[null,null,"Operator DVD  (f/Computer or DVD player)",1059848,42,null,{"$f":"F138*E138","v":0}]
[null,null,"Training CD, ec-H2O NanoClean (standard w/ec-H20 machine)",9006257,"N/C",null,{"$f":"IF(F139=0,\" \",\"N/C\")","v":" "}]
[]
[null,null,"Packaging",null,null,{"$f":"SUM(F142:F142)","v":0}]
[null,null,"Skid w/Carton, Non-Stackable",9000550,"N/C",null,{"$f":"IF(F142=0,\" \",\"N/C\")","v":" "}]
[]
[null,"AFTERMARKET ITEMS (ordered separately) :",null,null,null,{"$f":"SUM(F146,F150)","v":0}]
[]
[null,"Field Installed Accessories",null,"Reference Number",null,{"$f":"SUM(F147:F148)","v":0}]
[null,null,"Strobe Light on Tank",9000581,819.5,null,{"$f":"F147*E147","v":0}]
[null,null,"Utility Basket  (Small On Board Storage)        ",1018315,136.29999999999998,null,{"$f":"F148*E148","v":0}]
[]
[null,"Brushes and  (Replacements)",null,"Reference Number",null,{"$f":"SUM(F151,F164,F178,F184)","v":0}]
[null,null,"650mm/26\" Disk Scrubbing Brushes/Pads (2 Required)",null,null,{"$f":"SUM(F152:F162)","v":0}]
[null,null,"Polypropylene",1220223,147.5,null,{"$f":"F152*E152","v":0}]
[null,null,"Nylon",1220226,180.2,null,{"$f":"F153*E153","v":0}]
[null,null,"Super Abrasive",1220228,410.2,null,{"$f":"F154*E154","v":0}]
[]
[null,null,"Pad Driver",1220243,308.60000000000002,null,{"$f":"F156*E156","v":0}]
[null,null,"Pads ",null,null,{"$f":"SUM(F158:F162)","v":0}]
[null,null,"Brown Stripping - 3M     ",89046,15.2,null,{"$f":"F158*E158","v":0}]
[null,null,"Blue Scrubbing - 3M   ",89047,15.2,null,{"$f":"F159*E159","v":0}]
[null,null,"Red Cleaning - 3M         ",89048,15.2,null,{"$f":"F160*E160","v":0}]
[null,null,"White Polishing  - 3M    ",89049,15.2,null,{"$f":"F161*E161","v":0}]
[null,null,"Maroon Surface Prep Pad - 3M",1051024,17.8,null,{"$f":"F162*E162","v":0}]
[]
[null,null,"800mm/32\" Disk Scrubbing Brushes/Pads (2 Required)",null,null,{"$f":"SUM(F165:F176)","v":0}]
[null,null,"Polypropylene",1220224,181.5,null,{"$f":"F165*E165","v":0}]
[null,null,"Nylon",1220225,275.8,null,{"$f":"F166*E166","v":0}]
[null,null,"Super Abrasive",1220227,420,null,{"$f":"F167*E167","v":0}]
[]
[null,null,"Pad Driver",1220244,357.3,null,{"$f":"F169*E169","v":0}]
[null,null,"Pads ",null,null,{"$f":"SUM(F171:F176)","v":0}]
[null,null,"Brown Stripping - 3M     ","63248-1",19.600000000000001,null,{"$f":"F171*E171","v":0}]
[null,null,"Blue Scrubbing - 3M   ","63248-2",19.600000000000001,null,0]
[null,null,"Red Cleaning - 3M         ","63248-3",19.600000000000001,null,0]
[null,null,"White Polishing  - 3M    ","63248-4",19.600000000000001,null,0]
[null,null,"Black Stripping - Hi Pro - 3M",370092,31.8,null,0]
[null,null,"Maroon Surface Prep Pad - 3M",1051027,23.8,null,0]
[]
[null,null,"700mm/28\" Cylindrical Scrubbing Brushes",null,null,{"$f":"SUM(F179:F182)","v":0}]
[null,null,"Polypropylene",222304,190.9,null,{"$f":"F179*E179","v":0}]
[null,null,"Heavy Duty Polypropylene",374041,191.29999999999998,null,{"$f":"F180*E180","v":0}]
[null,null,"Nylon",222305,280,null,{"$f":"F181*E181","v":0}]
[null,null,"Abrasive",222306,403,null,{"$f":"F182*E182","v":0}]
[]
[null,null,"800mm/32\" Cylindrical Scrubbing Brushes",null,null,{"$f":"SUM(F185:F188)","v":0}]
[null,null,"Polypropylene",222307,215.2,null,{"$f":"F185*E185","v":0}]
[null,null,"Heavy Duty Polypropylene",374042,213.5,null,{"$f":"F186*E186","v":0}]
[null,null,"Nylon",222308,312.70000000000005,null,{"$f":"F187*E187","v":0}]
[null,null,"Abrasive",222309,464.8,null,{"$f":"F188*E188","v":0}]
[]
[null,"FaST-PAK ® Detergent",null,null,null,{"$f":"SUM(F191:F193)","v":0}]
[null,null,"FaST®  365 (2L) - Neutral",1017015,189.7,null,{"$f":"F191*E191","v":0}]
[null,null,"FaST®  665 (2L) - Degreaser",1017022,346,null,{"$f":"F192*E192","v":0}]
[null,null,"FaST®  965 (2L) - Degreaser",9002021,447.6,null,{"$f":"F193*E193","v":0}]
[]
[null,"Maintenance Items",null,"Reference Number",null,{"$f":"SUM(F196)","v":0}]
[null,null,"Disk & Cylindrical Brush Versions",null,null,{"$f":"SUM(F197:F218)","v":0}]
[null,null,"Squeegee Blade, Linatex, Rear - 650mm/26\"",390942,30.1,null,{"$f":"F197*E197","v":0}]
[null,null,"Squeegee Blade, Linatex, Front - 650mm/26\"",390943,21.6,null,{"$f":"F198*E198","v":0}]
[null,null,"Squeegee Blade, Linatex, Rear - 800mm/32\"",390922,28.200000000000003,null,{"$f":"F199*E199","v":0}]
[null,null,"Squeegee Blade, Linatex, Front - 800mm/32\"",390923,20.200000000000003,null,{"$f":"F200*E200","v":0}]
[null,null,"Squeegee Blade, Urethane, Front - 650mm/26\"",391377,54.2,null,{"$f":"F201*E201","v":0}]
[null,null,"Squeegee Blade, Urethane, Rear - 650mm/26\"",391378,78.599999999999994,null,0]
[null,null,"Squeegee Blade, Urethane, Front - 800mm/32\"",391379,62.1,null,0]
[null,null,"Squeegee Blade, Urethane, Rear - 800mm/32\"",391380,89.399999999999991,null,0]
[null,null,"Squeegee Blade, Gum Rubber, Rear - 650mm/26\"",390936,31,null,0]
[null,null,"Squeegee Blade, Gum Rubber, Rear - 800mm/32\"",390934,34.299999999999997,null,0]
[null,null,"Linatex Side Squeegee Blade - DISK (Order 2)",86859,54.6,null,0]
[null,null,"Linatex Side Squeegee Blade - Cylindrical (Order 2)",391334,54.6,null,0]
[null,null,"Squeegee Caster Wheel (Order 2)",1073476,17.3,null,0]
[null,null,"Front Skirt (650 mm/26\" Disk Model Only)",1013531,13.3,null,0]
[null,null,"Front Skirt (800mm/32\" Disk Model Only)",1011376,15.299999999999999,null,0]
[null,null,"Squeegee Roller",1010560,3.4,null,0]
[null,null,"Gasket, Recovery Tank",1013611,12.799999999999999,null,0]
[null,null,"Squeegee Hose",1015921,57.7,null,0]
[null,null,"Vacuum Filter",370114,31.3,null,0]
[null,null,"Vacuum Filter Gasket",1016392,6.1999999999999993,null,0]
[null,null,"Drain Hose Cap Assembly",1008639,19.100000000000001,null,0]
[null,null,"HydroLink® Battery Watering Kit ",9010300,314.8,null,0]
[]
[null,"Custom Solution--write in description, qty, price, and PN if applicable",null,null,null,{"$f":"SUM(F221)","v":0}]
[null,null,null,null,"Insert Prices Here",{"$f":"SUM(F222:F225)","v":0}]
[null,null,null,"Custom",null,{"$f":"IF(E222 <> \"\", 1, 0)","v":0},{"$f":"F222*E222","v":0}]
[null,null,null,"Custom",null,{"$f":"IF(E223 <> \"\", 1, 0)","v":0},{"$f":"F223*E223","v":0}]
[null,null,null,"Custom",null,{"$f":"IF(E224 <> \"\", 1, 0)","v":0},{"$f":"F224*E224","v":0}]
[null,null,null,"Custom",null,{"$f":"IF(E225 <> \"\", 1, 0)","v":0},{"$f":"F225*E225","v":0}]
[null,null,"Prepaid and Add","Freight",null,1,{"$f":"F226*E226","v":0}]
[null,null,"Subject to all applicable taxes","Tax",null,1,{"$f":"F227*E227","v":0}]
[]
[null,null,null,"MACHINE TOTAL*",null,null,{"$f":"SUM(G44:G227)","v":0},null,null,null,null,null,null,"This goes to \"My Documents\""]
[null,null,null,null,null,null,{"$f":"SUM(G229)","v":0}]
[]
[null,null,"National Leasing - Leasing Calculation Option:","Finance Option 1",null,"Finance Option 2",null,null,{"$f":"Financing!A38","v":"Rates 2016 - Rev. 7/1/2016"}]
[null,null,"Purchase Option:",1,null,"FMV Scrubber",null,null,{"$f":"Financing!A39","v":"“Blank Payment Amounts Indicate The Financing Option Or Purchase Options Selected Are Not "}]
[null,null,"24 Months",0,null,0,null,null,{"$f":"Financing!A40","v":"Applicable Or The Machine Total Is Below The Minimum Amount For The Selected Vendor”"}]
[null,null,"36 Months",0,null,0,null,null,{"$f":"Financing!A41","v":"\"Quoted monthly payments are estimates only and are based on a certain level of credit rating."}]
[null,null,"48 Months",0,null,0,null,null,{"$f":"Financing!A42","v":"Actual monthly payments may be higher depending on your credit rating.\""}]
[null,null,"60 Months",0,null,0,null,null,{"$f":"Financing!A43","v":"“Financing rates do not include Pre-Paid Service”"}]
[null,"   TennantTrue",null,null,0,0]
[]
[null,null,"Is customer interested in service program?","Yes","*State/County selection required for TennantTrue service options"]
[]
[null,null,"If not, why?"]
[]
[null,null,"Term:",36,null,null,"AB Brushes","No"]
[null,null,"Monthly machine usage (hrs):",25]
[]
[null,null,"TennantTrue: ","Rate Per Unit",null,"Hourly Labor Rate",null,"Site Visit Charge"]
[null,null,"Gold - Monthly",100]
[null,null,"Gold - Pre Pay Full Term",3348]
[null,null,"Silver - Monthly",58]
[null,null,"Silver - Annually",755]
[null,null,"Silver - Pre Pay Full Term",2217]
[null,null,"Silver - Per Visit",365]
[null,null,"Pay As You Go",null,null,null,null,null,null,null,"*State/County selection required for 'Pay As You Go' and 'On Demand'."]
[null,null,"On Demand"]
[]
[]
[]
[null,"Quote Special Instructions:"]
[]
[]
[null,{"$f":"Start_Here!E33","v":"Terms and Conditions"}]
[null,{"$f":"Start_Here!E34","v":"Ask your local sales rep for estimated lead times. Verify when placing order"}]
[null,{"$f":"Start_Here!E35","v":"All orders subject to acceptance by Tennant Sales and Service Company, Minneapolis, Minnesota"}]
[null,{"$f":"Start_Here!E36","v":"Prices subject to change without notice. Subject to any applicable taxes."}]
[null,{"$f":"Start_Here!E37","v":"Terms:  Net 30 days.  Payable in Canadian Funds"}]
[null,{"$f":"Start_Here!E38","v":"Freight:  Accessories, parts, supplies, detergents, and floor coatings orders delivered DDP "}]
[null,{"$f":"Start_Here!E39","v":"shipping point Frt PPD.  Machine orders delivered DDP shipping point Frt PPD and add."}]
[null,{"$f":"Start_Here!E40","v":"Returned Merchandise is subject to a restocking fee."}]
[null,{"$f":"Start_Here!E42","v":"Printed General Terms and Conditions are also available upon request."}]
[null,{"$f":"Start_Here!E43","v":0}]
[]
[]
[]
[null,null,null,null,"Quote Date :",null,{"$f":"Letter!$A$25","v":"2014-10-02"}]
["Order Placement Information:  To place your order, fill in PO# and customer signatures,"]
["call or fax to the numbers listed below. Customer Purchase Order is required."]
["If information is missing, orders will be entered and held until all information is received."]
[null,null,"Customer Number",null,{"$f":"Start_Here!F15","v":"Cust Grp 3"}]
[null,null,{"$f":"Start_Here!$F$5","v":0},null,{"$f":"Start_Here!F16","v":0}]
[null,null,{"$f":"Start_Here!$B$18","v":"Sold To Information (Please Verify)"}]
["Company",null,{"$f":"Start_Here!$C$19","v":""}]
["Address",null,{"$f":"Start_Here!$C$20","v":""}]
[null,null,{"$f":"Start_Here!$C$21","v":""}]
["Name",null,{"$f":"Start_Here!$C$22","v":""}]
["Phone",null,{"$f":"Start_Here!$C$23","v":""}]
[null,null,{"$f":"Start_Here!$B$11","v":"Ship To Information (Please Verify)"}]
["Company",null,{"$f":"Start_Here!$C$12","v":""}]
["Address",null,{"$f":"Start_Here!$C$13","v":""}]
[null,null,{"$f":"Start_Here!$C$14","v":""}]
["Name",null,{"$f":"Start_Here!$C$15","v":""}]
["Phone",null,{"$f":"Start_Here!$C$16","v":""}]
[null,null,{"$f":"Start_Here!$B$25","v":"Shipping/Carrier Instructions:"},null,"Order Special Instructions:"]
[null,null,{"$f":"Start_Here!$C$26","v":0}]
[]
[null,null," Customer Purchase Order No. "]
[null,null," (please attach copy) "]
[]
[]
[null,null," Tax Exempt ",null," Yes "]
[null,null,null,null," No "]
[null,null," If Yes, attach a copy of your exemption certificate. "]
[]
[null,null," Requested Delivery Date "]
[null,null,{"$f":"Start_Here!$F$14","v":0}]
[null,null,{"$f":"Start_Here!$F$8","v":0},null,{"$f":"Start_Here!$F$11","v":0}]
[null,null," Authorized Buyer (please print) ",null," Phone Number "]
[]
[null,null," Authorized Buyer Signature "]
[]
[null,null,"Tennant Representative"]
["Specialized Maintenance Equipment"]
[{"$f":"Start_Here!$C$45","v":"TENNANT · 701 NORTH LILAC DRIVE · P.O. BOX 1452 · MINNEAPOLIS, MN 55440-1452 ·"}]
[{"$f":"Start_Here!$C$46","v":" PHONE:800-553-8033 · FAX:763-513-2116"}]
[]
[null,"SPECIAL INFORMATION"]
[null,"Notes"]
[]
[null,1,"Pre-Configured Machines cannot add or change options.  All units are shipped via stackable skid with carton."]
[null,null,"When ordering, provide the reference number listed above.  Price does not include freight or tax.  Availability of units "]
[null,null,"and lead time may vary."]
[]
[null,2,"Only available on wet batteries, not sealed."]
[]
[null,3,"Only available on FaST models.  FaSTTM Floor Cleaning Concentrate FaST-PAKTM Cartridges. Proprietary super concentrated cleaners"]
[null,null,"for use on Tennant machines with FaSTTM Foam Scrubbing Technology Systems. One 2 liter FaST-PAKTM cartridge cleans one "]
[null,null,"million square feet (90,000m2).  Biodegradable. Phosphate free.  Safe for use on hard floors such as finished or  "]
[null,null,"unfinished VCT, Terrazzo,  Finished Wood, Marble, sealed or unsealed Concrete, Urethane or Epoxy coated surfaces. "]
[null,null,"One FaST-PAK comes with the machine - customer may select from either FaST 365, 665 or 965  Detergent."]
[]
[null,4,"One set of brushes or pad drivers come standard with a T7."]
[]
[null,5,"A French and English manual will be supplied for all units shipping into Quebec, Canada at no charge.  An additional manual"]
[null,null,"can be ordered (for a total of 3 manuals) for an additional charge as stated under 'Additional Operator Manual'."]
[]
[null,6,"Pre-Paid and Monthly Packages are available for the IRIS Information Service. IRIS Module is required and NOT included in the price of the IRIS Information Service:"]
[null,null,"3 Year Pre-Paid IRIS Information Service                 $350.00"]
[null,null,"5 Year Pre-Paid IRIS Information Service                 $560.00"]
[null,null,"A monthly contract can be set up at $14 per month w/ 12 month minimum commitment."]
[null,null,"IRIS Telemetry Module only covers the price of the hardware. IRIS Telemetry requires an IRIS Telemetry Module and an IRIS Information Service Package."]
[]
[null,7,"Shipping Weights and Dimensions","Pad Wrap","Skid w/Carton"]
[]
[null,null,"Weight (with 235AH batteries)","975 lbs / 443 kg","1000 lbs / 454 kg"]
[null,null,"Length","60\" / 1,524mm","62\" / 1,574mm"]
[null,null,"Width","39\" / 991mm","33\" / 838mm"]
[null,null,"Height","50\" / 1,270","48\" / 1,219mm"]

{"sheet":"T16","index":13,"n_rows":482,"n_cols":14,"rows_kept":482,"cut":false,"hidden":false,"merged":[[299,3,299,4],[299,5,299,6],[300,3,300,4],[300,5,300,6],[301,3,301,4],[301,5,301,6],[359,4,359,6],[363,2,363,4],[371,4,371,5],[348,2,348,5],[349,2,349,5],[350,2,350,5],[351,2,351,5],[353,2,353,5],[354,2,354,5],[357,2,357,5],[355,2,355,5],[356,2,356,5],[320,7,320,8],[325,1,325,6],[345,4,345,6],[347,2,347,5],[318,3,318,4],[318,5,318,6],[318,7,318,8],[319,3,319,4],[319,5,319,6],[319,7,319,8],[320,3,320,4],[320,5,320,6],[316,7,316,8],[317,3,317,4],[317,5,317,6],[317,7,317,8],[314,3,314,4],[314,5,314,6],[314,7,314,8],[315,3,315,4],[315,5,315,6],[315,7,315,8],[316,3,316,4],[316,5,316,6],[313,7,313,8],[302,3,302,4],[302,5,302,6],[305,4,305,8],[307,3,307,6],[309,3,309,4],[310,3,310,4],[312,7,312,8],[313,3,313,4],[313,5,313,6],[312,3,312,4],[312,5,312,6],[0,2,0,3],[1,2,1,3],[2,2,2,3],[3,2,3,3],[238,1,238,4],[11,2,11,6],[35,2,35,6],[36,2,36,6],[37,2,37,6],[38,2,38,6],[39,2,39,6],[56,2,56,3],[297,3,297,4],[297,5,297,6],[298,3,298,4],[298,5,298,6]]}
["T16",null,{"$f":"Start_Here!$C$8","v":"Contact Name"}]
[null,null,{"$f":"Start_Here!$C$5","v":"Company Name"}]
[null,null,{"$f":"Start_Here!$C$6","v":"Address"}]
[null,null,{"$f":"Start_Here!$C$7","v":"City, State Zip"}]
[null,null,{"$f":"Start_Here!$C$39","v":"Rep Name"}]
[null,null,{"$f":"Start_Here!$C$35","v":"Tennant Sales and Service Company"}]
[null,null,{"$f":"Start_Here!$C$36","v":"701 North Lilac Drive"}]
[null,null,{"$f":"Start_Here!$C$38","v":"Minneapolis, MN 55440-1452"}]
[null,null,{"$f":"Start_Here!$C$41","v":"800-553-8033"},null,"Quote Date :",null,{"$f":"Letter!$A$25","v":"2014-10-02"}]
[]
[]
[null,null,"BUILT-IN “TENNANT VALUE” INCLUDES:"]
[]
[null,null,"36V, 235 AH Battery Pack",null,"Removable Tool Caddy and Large Cargo Net Storage Area"]
[null,null,"20 Amp, 115 Volt 60 Hz Charger",null,"Standard Cylindrical or Disk Scrubbing Brushes (Select One)"]
[null,null,"Two Speed Electronic Overdrive Transmission with",null,"Hygienic Non-Corrosive Duramer™ Solution and Recovery Tanks"]
[null,null,"AC Propel Motor",null,"50 gal (190 L) Solution Tank"]
[null,null,"Disk or Cylindrcial Scrubbing - 36 in (910 mm) path",null,"60 gal (225 L) Recovery Tank"]
[null,null,"Steering Wheel Mounted, Touch-N-GO Control Module ",null,"10 gal (38 L) Demisting Chamber"]
[null,null,"     1-Step™ One-Button Scrub Operation",null,"Parabolic Rear Squeegee"]
[null,null,"     3 Down-Pressure Settings",null,"SmartRelease™ Breakaway System"]
[null,null,"     Steering Wheel Mounted Horn",null,"Linatex Squeegee Blades"]
[null,null,"     On Board Diagnostics",null,"Cast Aluminum Rear Squeegee Frame"]
[null,null,"     Water Shutoff Thumb Switch",null,"No Tool Squeegee and Brush Change"]
[null,null,"Automatic:",null,"In-Line Vacuum Fan Air Filter"]
[null,null,"     Parking Brake",null,"High Visibility Maintenance Touch Points"]
[null,null,"     Squeegee Lift",null,"Underwriters Laboratory (UL®) \"E\" Certification"]
[null,null,"     Water Shutoff",null,"Cup Holder"]
[null,null,"     Brush Shutoff When Idle",null,"Operator Manual and Video"]
[null,null,"     Brush Shutoff at 80% Battery Discharge",null,"Front and Rear Non-Marking Tires "]
[".",null,"ec-H2OTM Cleaning Solution Includes:",null,"FaST® Cleaning Solution Includes:"]
[null,null,"Electrically Converted Water Technology System",null,"Foam Scrubbing Technology System"]
[null,null,"Two Scrubbing Modes: ec-H2OTM& Conventional Scrubbing",null,"Two Scrubbing Modes: FaST® & Conventional Scrubbing"]
[null,null,null,null,"On-Board  FaST-PAK® 2L Detergent Cartridge (Select One)"]
[]
[null,null,"TENNANT COMPANY WARRANTY"]
[null,null,"36 MONTHS OR 2000 HOURS - PARTS"]
[null,null,"24 MONTHS - LABOR"]
[null,null,"6 MONTHS - TRAVEL"]
[null,null,"10 YEARS ON DURAMERTM TANKS"]
[]
[null,null,null,null,"                Quote Request Information"]
[null,null,null,null,null,null,"Fax (quote only)"]
[null,null,null,null,null,null,"Mail (quote,lit, specs)"]
[null,null,null,null,null,null,"Fax + Mail"]
[]
[null,null,null,null,"                Primary Use"]
[null,null,null,null,null,null,"Inside"]
[null,null,null,null,null,null,"Outside"]
[]
[null,null,"Description","Reference #","Price Each","Qty","Extended Price"]
[null,"Base Configuration",null,null,"CANADA",{"$f":"SUM(F53,F57,F62,F67,F75,F81,F89)","v":0}]
[null,null,"Cleaning Type",null,null,{"$f":"SUM(F54:F55)","v":0},null,null,null,null,null,{"$f":"SUM(F53)","v":0},"Surcharge Qty"]
[null,null,"T16 Rider - Conventional Disk Scrubbing","T16-910-D",32746,null,{"$f":"F54*E54","v":0},null,null,null,null,{"$f":"SUM(F54)","v":0},"Surcharge Qty"]
[null,null,"T16 Rider - Conventional Cylindrical Scrubbing","T16-910-C",32746,null,{"$f":"F55*E55","v":0}]
[]
[null,null,"Cleaning Technology: (conventional is standard,  ec-H2O or FaST: can also operate in conventional mode) (Note 1)",null,null,{"$f":"SUM(F58:F60)","v":0}]
[null,null,"ec-H2O™","ec-H2O-T16",3724,null,{"$f":"F58*E58","v":0}]
[null,null,"FaST® ","FaST-T16",3476,null,{"$f":"F59*E59","v":0}]
[null,null,"ES® Extended Scrub ","ES-T16",4193,null,{"$f":"F60*E60","v":0}]
[]
[null,null,"Squeegee Material ",null,null,{"$f":"SUM(F63:F65)","v":0}]
[null,null,"Linatex",null,"N/C",null,{"$f":"IF(F63=0,\" \",\"N/C\")","v":" "}]
[null,null,"Gum Rubber",null,"N/C",null,{"$f":"IF(F64=0,\" \",\"N/C\")","v":" "}]
[null,null,"Urethane",null,"N/C",null,{"$f":"IF(F65=0,\" \",\"N/C\")","v":" "}]
[]
[null,null,"Battery Type (Notes 2, 3, 4, & 5)",null,null,{"$f":"SUM(F68:F73)","v":0}]
[null,null,"Wet 240 AH",9008140,"N/C",null,{"$f":"IF(F68=0,\" \",\"N/C\")","v":" "}]
[null,null,"Wet 360 AH (in lieu of standard)",9008141,965,null,{"$f":"F69*E69","v":0}]
[null,null,"Sealed/MF AGM 312AH C/6",325818,4289,null,{"$f":"F70*E70","v":0}]
[null,null,"Less Battery, DEDUCT","LESS BATTERY",-698,null,{"$f":"F71*E71","v":0}]
[]
[null,null,"HydroLink® Battery Watering Kit",9009620,698,null,{"$f":"F73*E73","v":0}]
[]
[null,null,"Battery Exchange System (Notes 6 & 7)",null,null,{"$f":"SUM(F76:F79)","v":0}]
[null,null,"Rollout Battery System (roll-out gear in machine & battery case (no batteries)   (Note 6b)",9008082,3237,null,{"$f":"F76*E76","v":0}]
[null,null,"Extra Battery, 360 AH Wet (Note 7a)",9008523,2161,null,{"$f":"F77*E77","v":0}]
[null,null,"Extra Rollout Steel Battery Case (no battery)",369483,551,null,{"$f":"F78*E78","v":0}]
[null,null,"EasyGlide™ Battery Cart (Note 7)",9007087,2301,null,{"$f":"F79*E79","v":0}]
[]
[null,null,"Charger  (Note 8)","Reference #","CAD Price",{"$f":"SUM(F82:F87)","v":0}]
[null,null,"21A 85-265V AC 50/60Hz 1Ph - Off-Board for Lead Acid Battery",9003372,"N/C",null,{"$f":"IF(F82=0,\" \",\"N/C\")","v":" "}]
[null,null,"21A 85-265V AC 50/60Hz 1Ph - Off-Board for Rollout System Only",9003373,"N/C",null,{"$f":"IF(F83=0,\" \",\"N/C\")","v":" "}]
[null,null,"20A 85-130V AC 50/60Hz 1Ph - On-Board Charger in lieu of standard",9008080,770,null,{"$f":"F84*E84","v":0}]
[null,null,"21A 85-265V AC 50/60Hz 1Ph - Off-Board charger for AGM Battery (In lieu of std)",314787,700,null,{"$f":"F85*E85","v":0}]
[null,null,"21A 85-265V AC 50/60Hz 1Ph - On Board for AGM Battery  (Note 8a)",325824,2035,null,{"$f":"F86*E86","v":0}]
[null,null,"Less Charger, DEDUCT","LESS CHARGER",-433,null,{"$f":"F87*E87","v":0}]
[]
[null,null,"UL Rating ",null,null,{"$f":"SUM(F90:F91)","v":0}]
[null,null,"UL® Type E",null,"N/C",null,{"$f":"IF(F90=0,\" \",\"N/C\")","v":" "}]
[null,null,"UL® Type ES",325825,2674,null,{"$f":"F91*E91","v":0}]
[]
[null,"Packages  (Note 9)",null,null,null,{"$f":"SUM(F95:F99)","v":0}]
[null,null,"Heavy Duty Protection Package: ",null,null,{"$f":"SUM(F95)","v":0}]
[null,null,"OHG, Front Bumper, & Rear Squeegee Protection",9008530,2928,null,{"$f":"F95*E95","v":0}]
[null,null,"Productivity Package - Scrubbing: ",null,null,{"$f":"SUM(F97)","v":0}]
[null,null,"Side Scrub Brush, Vac Wand, Spray Hose",9008531,5140,null,{"$f":"F97*E97","v":0}]
[null,null,"Safety Light Package: ",null,null,{"$f":"SUM(F99)","v":0}]
[null,null,"LED Head Light and AV Backup Alarm (strobe warning light)",9008529,836,null,{"$f":"F99*E99","v":0}]
[]
[null,"Cleaning Performance",null,"Reference Number",null,{"$f":"SUM(F102:F112)","v":0}]
[null,null,"Pre-Sweep with Dual Side Brush (Note 10)"," 9008048 ",5820,null,{"$f":"F102*E102","v":0}]
[null,null,"Side Brush: RH Sweeping (Cylindrical Only)",9008526,2907,null,0]
[null,null,"Side Brush: RH Scrubbing",9008038,4093,null,0]
[null,null,"Vacuum  Wand",9008046,807,null,0]
[null,null,"Spray Nozzle with Hose",9008042,1151,null,0]
[null,null,"Dual Vacuum Fans  (Note 11)",9008036,801,null,0]
[null,null,"Drain Control Valve - Solution and Recover  (Note 12)",325692,1685,null,0]
[null,null,"FaST® 365 (2L)",1017015,"N/C",null,{"$f":"IF(F109=0,\" \",\"N/C\")","v":" "}]
[null,null,"FaST® 665 (2L)",1017022,"N/C",null,{"$f":"IF(F110=0,\" \",\"N/C\")","v":" "}]
[null,null,"FaST® 965 (2L)",9002021,"N/C",null,{"$f":"IF(F111=0,\" \",\"N/C\")","v":" "}]
[null,null,"Solvent Based Degreaser, 5 Gal (non-FaST Units)",9006770,"N/C",null,{"$f":"IF(F112=0,\" \",\"N/C\")","v":" "}]
[]
[null,"Machine Protection & Safety",null,"Reference Number",null,{"$f":"SUM(F115:F126)","v":0}]
[null,null,"Heavy Duty Front Bumper  (Note 13)",9006922,873,null,{"$f":"F115*E115","v":0}]
[null,null,"Heavy Duty Squeegee Protection",9008066,682,null,0]
[null,null,"Overhead Guard (order SE Front Bumper 9008060 also) (Note 14)",9008018,1897,null,0]
[null,null,"Deluxe Seat with Arm Rest (In Lieu of Standard) (Note 15)",9008032,530,null,0]
[null,null,"Headlight(s) LED",9008068,367,null,0]
[null,null,"AV BU Alarm-Strobe on Tank",9008138,623,null,0]
[null,null,"Strobe Light on OHG",9008134,623,null,0]
[null,null,"Alternate Strobe Lens",null,null,{"$f":"SUM(F123:F124)","v":0}]
[null,null,"Red",1027798,"N/C",null,{"$f":"IF(F123=0,\" \",\"N/C\")","v":" "}]
[null,null,"Blue",1027800,"N/C",null,{"$f":"IF(F124=0,\" \",\"N/C\")","v":" "}]
[null,null,"Fire Extinguisher",9008079,315,null,{"$f":"F125*E125","v":0}]
[null,null,"Trailer Transport Kit (cover latches for trailering)",9008057,175,null,{"$f":"F126*E126","v":0}]
[]
[null,"Brushes and Pads",null,"Reference Number",null,{"$f":"SUM(F129,F142,F148)","v":0}]
[null,null,"Disk Scrubbing Brushes/Pads (2 Required)",null,null,{"$f":"SUM(F130:F140)","v":0}]
[null,null,"Polypropylene Brush",1220188,"N/C",null,{"$f":"IF(F130=0,\" \",\"N/C\")","v":" "}]
[null,null,"Nylon Brush",1220191,"N/C",null,{"$f":"IF(F131=0,\" \",\"N/C\")","v":" "}]
[null,null,"Super Abrasive Brush",1220190,381,null,{"$f":"F132*E132","v":0}]
[]
[null,null,"Pad Driver",1220200,"N/C",null,{"$f":"IF(F134=0,\" \",\"N/C\")","v":" "}]
[null,null,"Pads",null,null,{"$f":"SUM(F136:F140)","v":0}]
[null,null,"Brown Stripping - 3M",11777,22.4,null,{"$f":"F136*E136","v":0}]
[null,null,"Blue Scrubbing - 3M     ",11778,22.4,null,{"$f":"F137*E137","v":0}]
[null,null,"Red Cleaning - 3M       ",11780,22.4,null,{"$f":"F138*E138","v":0}]
[null,null,"White Polishing - 3M",11781,22.4,null,{"$f":"F139*E139","v":0}]
[null,null,"Black Stripping - Hi Pro - 3M",370093,24,null,{"$f":"F140*E140","v":0}]
[]
[null,null,"Cylindrical Scrubbing Brushes (2 Required)",null,null,{"$f":"SUM(F143:F146)","v":0}]
[null,null,"Polypropylene Brush",1053893,"N/C",null,{"$f":"IF(F143=0,\" \",\"N/C\")","v":" "}]
[null,null,"Heavy Duty Polypropylene Brush",1053894,"N/C",null,{"$f":"IF(F144=0,\" \",\"N/C\")","v":" "}]
[null,null,"Polyester Brush",1053895,"N/C",null,{"$f":"IF(F145=0,\" \",\"N/C\")","v":" "}]
[null,null,"Super Abrasive Brush",1062578,381,null,{"$f":"F146*E146","v":0}]
[]
[null,null,"Disk Scrubbing Brush/Pad and Sweeping Brush for Side Brush Option (1 Required)",null,null,{"$f":"SUM(F149:F160)","v":0}]
[null,null,"Polypropylene Scrubbing Brush",1220240,"N/C",null,{"$f":"IF(F149=0,\" \",\"N/C\")","v":" "}]
[null,null,"Polypropylene Sweeping Brush",1220186,"N/C",null,{"$f":"IF(F150=0,\" \",\"N/C\")","v":" "}]
[null,null,"Heavy Duty Polypropylene Brush",1220231,"N/C",null,{"$f":"IF(F151=0,\" \",\"N/C\")","v":" "}]
[null,null,"Nylon Brush",1220230,"N/C",null,{"$f":"IF(F152=0,\" \",\"N/C\")","v":" "}]
[null,null,"Super Abrasive Brush",1220232,381,null,{"$f":"F153*E153","v":0}]
[]
[null,null,"Pad Driver",1220243,"N/C",null,{"$f":"IF(F155=0,\" \",\"N/C\")","v":" "}]
[null,null,"Pads",null,null,{"$f":"SUM(F157:F160)","v":0}]
[null,null,"Brown Stripping - 3M",89046,15.2,null,{"$f":"F157*E157","v":0}]
[null,null,"Blue Scrubbing - 3M     ",89047,15.2,null,{"$f":"F158*E158","v":0}]
[null,null,"Red Cleaning - 3M       ",89048,15.2,null,{"$f":"F159*E159","v":0}]
[null,null,"White Polishing - 3M",89049,15.2,null,{"$f":"F160*E160","v":0}]
[]
[null,"Support",null,"Reference Number",null,{"$f":"SUM(F163:F175)","v":0}]
[null,null,"Standard Warranty",null,"N/C",null,{"$f":"IF(F163=0,\" \",\"N/C\")","v":" "}]
[null,null,"Ultimate Performance Guarantee",50619,"N/C",null,{"$f":"IF(F164=0,\" \",\"N/C\")","v":" "}]
[null,null,"Operator Manual (English)",9008142,"N/C",null,{"$f":"IF(F165=0,\" \",\"N/C\")","v":" "}]
[null,null,"Operator Manual (Spanish)",9008143,"N/C",null,{"$f":"IF(F166=0,\" \",\"N/C\")","v":" "}]
[null,null,"Operator Manual (French)  (Note 16)",9008144,"N/C",null,{"$f":"IF(F167=0,\" \",\"N/C\")","v":" "}]
[null,null,"Additional Operator Manual","SEE ABOVE",54,null,{"$f":"F168*E168","v":0}]
[null,null,"T16 Parts Manual",9008148,"N/C",null,{"$f":"IF(F169=0,\" \",\"N/C\")","v":" "}]
[null,null,"Additional Parts Manual","SEE ABOVE",90,null,0]
[null,null,"Operator DVD (English, Spanish, French) Verify Languages",9008532,"N/C",null,{"$f":"IF(F171=0,\" \",\"N/C\")","v":" "}]
[null,null,"Additional Operator DVD","SEE ABOVE",42,null,0]
[null,null,"Service Manual",9008149,182,null,0]
[]
[null,null,"Packaging",null,null,{"$f":"SUM(F176:F177)","v":0}]
[null,null,"Crate - Non-Pre-Sweep ",9008063,"N/C",null,{"$f":"IF(F176=0,\" \",\"N/C\")","v":" "}]
[null,null,"Crate - Pre-Sweep",9008056,"N/C",null,{"$f":"IF(F177=0,\" \",\"N/C\")","v":" "}]
[]
[null,"AFTERMARKET ITEMS (ordered separately) :",null,null,null,{"$f":"SUM(F181)","v":0}]
[]
[null,"Brushes and  (Replacements)",null,"Reference Number",null,{"$f":"SUM(F182,F195,F201)","v":0}]
[null,null,"Disk Scrubbing Brushes/Pads (2 Required)",null,null,{"$f":"SUM(F183:F193)","v":0}]
[null,null,"Polypropylene Brush",1220188,315.5,null,{"$f":"F183*E183","v":0}]
[null,null,"Nylon Brush",1220191,403.5,null,{"$f":"F184*E184","v":0}]
[null,null,"Super Abrasive Brush",1220190,628.1,null,{"$f":"F185*E185","v":0}]
[]
[null,null,"Pad Driver",1220200,393.90000000000003,null,{"$f":"F187*E187","v":0}]
[null,null,"Pads ",null,null,{"$f":"SUM(F189:F193)","v":0}]
[null,null,"Brown Stripping - 3M",11777,22.4,null,{"$f":"F189*E189","v":0}]
[null,null,"Blue Scrubbing - 3M     ",11778,22.4,null,{"$f":"F190*E190","v":0}]
[null,null,"Red Cleaning - 3M       ",11780,22.4,null,{"$f":"F191*E191","v":0}]
[null,null,"White Polishing - 3M",11781,22.4,null,{"$f":"F192*E192","v":0}]
[null,null,"Black Stripping - Hi Pro - 3M",370093,24,null,{"$f":"F193*E193","v":0}]
[]
[null,null,"Cylindrical Scrubbing Brushes (2 Required)",null,null,{"$f":"SUM(F196:F199)","v":0}]
[null,null,"Polypropylene Brush",1053893,258.8,null,{"$f":"F196*E196","v":0}]
[null,null,"Heavy Duty Polypropylene Brush",1053894,252.7,null,{"$f":"F197*E197","v":0}]
[null,null,"Polyester Brush",1053895,359.70000000000005,null,{"$f":"F198*E198","v":0}]
[null,null,"Super Abrasive Brush",1062578,620.80000000000007,null,{"$f":"F199*E199","v":0}]
[]
[null,null,"Disk Scrubbing Brush/Pad and Sweeping Brush for Side Brush Option (1 Required)",null,null,{"$f":"SUM(F202:F214)","v":0}]
[null,null,"Polypropylene Brush",1220240,233.29999999999998,null,{"$f":"F202*E202","v":0}]
[null,null,"Heavy Duty Polypropylene Brush",1220231,253.9,null,{"$f":"F203*E203","v":0}]
[null,null,"Soft Nylon Brush",1220230,284.5,null,{"$f":"F204*E204","v":0}]
[null,null,"Super Abrasive Brush",1220232,423.5,null,{"$f":"F205*E205","v":0}]
[]
[null,null,"Pad Driver",1220243,308.60000000000002,null,{"$f":"F207*E207","v":0}]
[null,null,"Pads",null,null,{"$f":"SUM(F209:F214)","v":0}]
[null,null,"Brown Stripping - 3M",89046,15.2,null,{"$f":"F209*E209","v":0}]
[null,null,"Blue Scrubbing - 3M     ",89047,15.2,null,{"$f":"F210*E210","v":0}]
[null,null,"Red Cleaning - 3M       ",89048,15.2,null,{"$f":"F211*E211","v":0}]
[null,null,"White Polishing - 3M",89049,15.2,null,{"$f":"F212*E212","v":0}]
[]
[null,null,"Polypropylene, Sweeping Brush (Cyl Only)",1220186,143.29999999999998,null,{"$f":"F214*E214","v":0}]
[]
[null,"FaST-PAK ® Detergent",null,null,null,{"$f":"SUM(F217:F219)","v":0}]
[null,null,"FaST®  365 (2L) - Neutral",1017015,189.7,null,{"$f":"F217*E217","v":0}]
[null,null,"FaST®  665 (2L) - Degreaser",1017022,346,null,{"$f":"F218*E218","v":0}]
[null,null,"FaST®  965 (2L) - Degreaser",9002021,447.6,null,{"$f":"F219*E219","v":0}]
[]
[null,"Maintenance Items",null,"Reference Number",null,{"$f":"SUM(F222:F237)","v":0}]
[null,null,"Squeegee Blade, Linatex, Rear",1051283,41.800000000000004,null,{"$f":"F222*E222","v":0}]
[null,null,"Squeegee Blade, Gum Rubber, Rear",1061199,38.4,null,0]
[null,null,"Squeegee Blade, Urethane, Front",1061200,70.3,null,0]
[null,null,"Squeegee Blade, Urethane, Rear",1061198,98.5,null,0]
[null,null,"Squeegee Blade, Linatex, Front",1056453,29.900000000000002,null,0]
[null,null,"Squeegee Blade, Gum Rubber, Front",1061201,23,null,0]
[null,null,"Side Squeegee Blade, Linatex (Order 2)",1054670,54.2,null,0]
[null,null,"Side Squeegee Blade, Urethane (Order 2)",1061185,109,null,0]
[null,null,"Side Squeegee Blade, Gum Rubber (Order 2)",1061184,35.6,null,0]
[null,null,"Squeegee Wheel",363162,26.8,null,0]
[null,null,"Squeegee Caster Wheel (Order 2)",1055515,92.6,null,0]
[null,null,"Squeegee Hose",1054370,61.8,null,0]
[null,null,"Squeegee Hose with Vac Wand",1056831,125.89999999999999,null,0]
[null,null,"Front Skirt (Disk Only)",1057021,15.9,null,0]
[null,null,"Rear Skirt (Disk Only)",223520,16.100000000000001,null,{"$f":"F236*E236","v":0}]
[null,null,"Filter, Panel",1037822,37.4,null,{"$f":"F237*E237","v":0}]
[]
[null,"Aftermarket - FINISHED CONCRETE SYSTEMS      No Additional Discounts Allowed",null,null,null,{"$f":"SUM(F240:F249)","v":0}]
[null,null,"18 in - 25/35 grit CCW Concrete Tool (Counter-clockwise)",1059826,841,null,{"$f":"F240*E240","v":0}]
[null,null,"18 in - 25/35 grit CW Concrete Tool (Clockwise)",1059858,841,null,0]
[null,null,"18 in - 100 grit CCW Concrete Tool (Counter-clockwise)",1057117,841,null,0]
[null,null,"18 in - 100 grit CW Concrete Tool (Clockwise)",1057120,841,null,0]
[null,null,"18 in - 50 Grit Polymer Tool (Brown Blade)",1059755,911.2,null,0]
[null,null,"18 in - 100 Grit Polymer Tool (Black Blade)",1059756,883.4,null,0]
[null,null,"18 in - 200 Grit Polymer Tool (Blue Blade)",1059757,883.4,null,0]
[null,null,"18 in - 400 Grit Polymer Tool (Green Blade)",1059758,883,null,0]
[null,null,"18 in - 1000 Grit Polymer Tool (Red Blade)",1059759,1169.5999999999999,null,0]
[null,null,"18 in - 2000 Grit Polymer Tool (Tan Blade)",1059760,1207.8,null,0]
[null,null,"Replacement Blades",null,null,{"$f":"SUM(F251:F258)","v":0}]
[null,null,"25/35 Grit Concrete Blades - 16/set",9007162,560,null,{"$f":"F251*E251","v":0}]
[null,null,"100 Grit Concrete Blades - 16/set",9006738,588,null,0]
[null,null," 50 Grit Polymer Blades - 11/set",1060171,184.4,null,0]
[null,null," 100 Grit Polymer Blades - 11/set",1060180,184.4,null,0]
[null,null," 200 Grit Polymer Blades - 11/set",1060181,184.4,null,0]
[null,null," 400 Grit Polymer Blades - 11/set",1060182,184.4,null,0]
[null,null," 1000 Grit Polymer Blades - 11/set",1060183,242.7,null,0]
[null,null," 2000 Grit Polymer Blades - 11/set",1060184,249.1,null,0]
[null,null,"Concrete Finisher - Maintainer ",null,null,{"$f":"SUM(F260:F261)","v":0}]
[null,null,"Concrete Finisher-Maintainer - 15 Gallon",9006838,393,null,{"$f":"F260*E260","v":0}]
[null,null,"Concrete Finisher-Maintainer - 55 Gallon",9006839,1357.8,null,{"$f":"F261*E261","v":0}]
[]
[null,"Detergents   See NOTE 18 for Detergent Replacement Information Table ",null,null,null,{"$f":"SUM(F264:F281)","v":0}]
[null,null,"General Purpose Cleaner 2 -2.5 Gal.",9006764,91.2,null,{"$f":"F264*E264","v":0}]
[null,null,"General Purpose Cleaner 15 Gal w/Pump",9006765,265.5,null,0]
[null,null,"General Purpose Cleaner 55 Gal w/Pump",9006767,834.4,null,0]
[null,null,"General Purpose Cleaner 275 Gal Tote",9006769,3185.9,null,0]
[null,null,"High Alkaline Degreaser 2 -2.5 Gal.",9006776,121.4,null,0]
[null,null,"High Alkaline Degreaser 15 Gal w/Pump",9006777,333.9,null,0]
[null,null,"High Alkaline Degreaser 55 Gal w/Pump",9006779,1092.5,null,0]
[null,null,"High Alkaline Degreaser 275 Gal Tote",9006781,4096,null,0]
[null,null,"Solvent Based Degreaser,  2 - 2.5 Gal.",9006770,182.2,null,0]
[null,null,"Solvent Based Degreaser, 55 Gallon",9006773,1668.8,null,0]
[null,null,"Solvent Based Degreaser,  2 - 2.5 Gal. (yellow)",9006770,182.2,null,0]
[null,null,"Solvent Based Degreaser, 15 Gal. w/pump (yellow)",9006771,500.7,null,0]
[null,null,"Solvent Based Degreaser, 55 Gallon (yellow)",9006773,1668.8,null,0]
[null,null,"Solvent Based Degreaser, 275 Gal tote (yellow)",9006775,6371.6,null,0]
[null,null,"Super Strength Degreaser,  2 - 2.5 Gal. (orange)",9008791,279.3,null,0]
[null,null,"Super Strength Degreaser, 15 Gallon w/pump (orange)",9008792,837.9,null,0]
[null,null,"Super Strength Degreaser, 55 Gallon w/pump (orange)",9008794,2013.9,null,0]
[null,null,"Super Strength Degreaser 275 Gal Tote (orange)",9008798,8591.1,null,0]
[null,"Granular Detergents",null,null,null,{"$f":"SUM(F283:F284)","v":0}]
[null,null,"High Alkaline Granular Degreaser, 22 lb (10 bags-2.2 lbs per bag) ",9006782,74.400000000000006,null,{"$f":"F283*E283","v":0}]
[null,null,"High Alkaline Granular Degreaser, 250 lb. drum.",9006783,743.4,null,{"$f":"F284*E284","v":0}]
[]
[null,"Custom Solution--write in description, qty, price, and PN if applicable",null,null,null,{"$f":"SUM(F287)","v":0}]
[null,null,null,null,"Insert Prices Here",{"$f":"SUM(F288:F291)","v":0}]
[null,null,null,"Custom",null,{"$f":"IF(E288 <> \"\", 1, 0)","v":0},{"$f":"F288*E288","v":0}]
[null,null,null,"Custom",null,{"$f":"IF(E289 <> \"\", 1, 0)","v":0},{"$f":"F289*E289","v":0}]
[null,null,null,"Custom",null,{"$f":"IF(E290 <> \"\", 1, 0)","v":0},{"$f":"F290*E290","v":0}]
[null,null,null,"Custom",null,{"$f":"IF(E291 <> \"\", 1, 0)","v":0},{"$f":"F291*E291","v":0}]
[null,null,"Prepaid and Add","Freight",null,1,{"$f":"F292*E292","v":0}]
[null,null,"Subject to all applicable taxes","Tax",null,1,{"$f":"F293*E293","v":0}]
[]
[null,null,null,"MACHINE TOTAL*",null,null,{"$f":"SUM(G54:G293)","v":0},null,null,null,null,null,null,"This goes to \"My Documents\""]
[null,null,null,null,null,null,{"$f":"SUM(G295)","v":0}]
[]
[null,null,"National Leasing - Leasing Calculation Option:","Finance Option 1",null,"Finance Option 2",null,null,{"$f":"Financing!A38","v":"Rates 2016 - Rev. 7/1/2016"}]
[null,null,"Purchase Option:",1,null,"FMV Scrubber",null,null,{"$f":"Financing!A39","v":"“Blank Payment Amounts Indicate The Financing Option Or Purchase Options Selected Are Not "}]
[null,null,"24 Months",0,null,0,null,null,{"$f":"Financing!A40","v":"Applicable Or The Machine Total Is Below The Minimum Amount For The Selected Vendor”"}]
[null,null,"36 Months",0,null,0,null,null,{"$f":"Financing!A41","v":"\"Quoted monthly payments are estimates only and are based on a certain level of credit rating."}]
[null,null,"48 Months",0,null,0,null,null,{"$f":"Financing!A42","v":"Actual monthly payments may be higher depending on your credit rating.\""}]
[null,null,"60 Months",0,null,0,null,null,{"$f":"Financing!A43","v":"“Financing rates do not include Pre-Paid Service”"}]
[null,"   TennantTrue",null,null,0,0]
[]
[null,null,"Is customer interested in service program?","Yes","*State/County selection required for TennantTrue service options"]
[]
[null,null,"If not, why?"]
[]
[null,null,"Term:",36,null,null,"AB Brushes","No"]
[null,null,"Monthly machine usage (hrs):",25]
[]
[null,null,"TennantTrue: ","Rate Per Unit",null,"Hourly Labor Rate",null,"Site Visit Charge"]
[null,null,"Gold - Monthly",125]
[null,null,"Gold - Pre Pay Full Term",4185]
[null,null,"Silver - Monthly",93]
[null,null,"Silver - Annually",1097]
[null,null,"Silver - Pre Pay Full Term",3223]
[null,null,"Silver - Per Visit",445]
[null,null,"Pay As You Go",null,null,null,null,null,null,null,"*State/County selection required for 'Pay As You Go' and 'On Demand'."]
[null,null,"On Demand"]
[]
[]
[]
[null,"Quote Special Instructions:"]
[]
[]
[null,{"$f":"Start_Here!E33","v":"Terms and Conditions"}]
[null,{"$f":"Start_Here!E34","v":"Ask your local sales rep for estimated lead times. Verify when placing order"}]
[null,{"$f":"Start_Here!E35","v":"All orders subject to acceptance by Tennant Sales and Service Company, Minneapolis, Minnesota"}]
[null,{"$f":"Start_Here!E36","v":"Prices subject to change without notice. Subject to any applicable taxes."}]
[null,{"$f":"Start_Here!E37","v":"Terms:  Net 30 days.  Payable in Canadian Funds"}]
[null,{"$f":"Start_Here!E38","v":"Freight:  Accessories, parts, supplies, detergents, and floor coatings orders delivered DDP "}]
[null,{"$f":"Start_Here!E39","v":"shipping point Frt PPD.  Machine orders delivered DDP shipping point Frt PPD and add."}]
[null,{"$f":"Start_Here!E40","v":"Returned Merchandise is subject to a restocking fee."}]
[null,{"$f":"Start_Here!E42","v":"Printed General Terms and Conditions are also available upon request."}]
[null,{"$f":"Start_Here!E43","v":0}]
[]
[]
[]
[null,null,null,null,"Quote Date :",null,{"$f":"Letter!$A$25","v":"2014-10-02"}]
["Order Placement Information:  To place your order, fill in PO# and customer signatures,"]
["call or fax to the numbers listed below. Customer Purchase Order is required."]
["If information is missing, orders will be entered and held until all information is received."]
[null,null,"Customer Number",null,{"$f":"Start_Here!F15","v":"Cust Grp 3"}]
[null,null,{"$f":"Start_Here!$F$5","v":0},null,{"$f":"Start_Here!F16","v":0}]
[null,null,{"$f":"Start_Here!$B$18","v":"Sold To Information (Please Verify)"}]
["Company",null,{"$f":"Start_Here!$C$19","v":""}]
["Address",null,{"$f":"Start_Here!$C$20","v":""}]
[null,null,{"$f":"Start_Here!$C$21","v":""}]
["Name",null,{"$f":"Start_Here!$C$22","v":""}]
["Phone",null,{"$f":"Start_Here!$C$23","v":""}]
[null,null,{"$f":"Start_Here!$B$11","v":"Ship To Information (Please Verify)"}]
["Company",null,{"$f":"Start_Here!$C$12","v":""}]
["Address",null,{"$f":"Start_Here!$C$13","v":""}]
[null,null,{"$f":"Start_Here!$C$14","v":""}]
["Name",null,{"$f":"Start_Here!$C$15","v":""}]
["Phone",null,{"$f":"Start_Here!$C$16","v":""}]
[null,null,{"$f":"Start_Here!$B$25","v":"Shipping/Carrier Instructions:"},null,"Order Special Instructions:"]
[null,null,{"$f":"Start_Here!$C$26","v":0}]
[]
[null,null," Customer Purchase Order No. "]
[null,null," (please attach copy) "]
[]
[]
[null,null," Tax Exempt ",null," Yes "]
[null,null,null,null," No "]
[null,null," If Yes, attach a copy of your exemption certificate. "]
[]
[null,null," Requested Delivery Date "]
[null,null,{"$f":"Start_Here!$F$14","v":0}]
[null,null,{"$f":"Start_Here!$F$8","v":0},null,{"$f":"Start_Here!$F$11","v":0}]
[null,null," Authorized Buyer (please print) ",null," Phone Number "]
[]
[null,null," Authorized Buyer Signature "]
[]
[null,null,"Tennant Representative"]
["Specialized Maintenance Equipment"]
[{"$f":"Start_Here!$C$45","v":"TENNANT · 701 NORTH LILAC DRIVE · P.O. BOX 1452 · MINNEAPOLIS, MN 55440-1452 ·"}]
[{"$f":"Start_Here!$C$46","v":" PHONE:800-553-8033 · FAX:763-513-2116"}]
[]
[]
[null,"SPECIAL INFORMATION"]
[]
[null,1,"Cleaning Solutions are available factory installed only; Select only one, none are available combined with another:"]
[null,null,"   ES Extended Scrubbing system"]
[null,null,"ec-H2O™ option (Disk)"]
[null,null,"ec-H2O™ option (Cylindrical)"]
[null,null,"FaST®  option (Disk)"]
[null,null,"FaST®  option (Cylindrical)"]
[null,null,"T16 ES does have the continuous cleaning ES filter system and detergent dispensing."]
[]
[null,2,"The battery compartment will fit six 6-volt batteries of this size:",null,"Length          Width","Height"]
[null,null,null,"Battery Size","11.66 in           6.94 in","14.38 in"]
[null,null,null,null,"295mm           175 mm","365mm"]
[]
[null,3,"Model T16 Continuous Runtime Chart.",null,"Standard","High"]
[null,null,null,null,"Capacity","Capacity"]
[null,null,null,null,"235AH","360AH"]
[null,null,"T16 Base Unit (economy mode, main scrub only)",null,"2.75 hours","4.25 hours"]
[null,null,"T16 Base Unit with RH Sidebrush",null,"2.25 hours","3.50 hours"]
[null,null,"T16 with Dual Vacuum Fans",null,"2.0 hours","3.25 hours"]
[null,null,"T16 with Pre-Sweep (dust control \"off\")",null,"N/A ","3.0  hours"]
[null,null,"T16 with Pre-Sweep (dust control \"on\")",null,"N/A ","2.5 hours"]
[null,null,"The above runtimes are guidelines.  Actual times will vary based on floor conditions, final machine configuration & usage"]
[null,null,"The battery charger connector is a 50 amp Anderson ( gray ). The battery connector is an Anderson 175 amp connector ( gray )."]
[]
[null,4,"To calculate weights with batteries add the following to the product “Net” or “Ship” weights:"]
[null,null,"235 AH Battery Pack = + 6 Batteries @ 67 lbs (30.4kg) each = 402 lbs (182.5 kg)"]
[null,null,"360 AH Battery Pack = + 6 Batteries @ 97 lbs (44 kg) each = 582 lbs (264.2 kg)"]
[]
[null,5,"Expected Cycle Life:  Cycle life is the number of charge cycles a battery is expected to last."]
[null,null,"235 AH Battery = 500 Cycles"]
[null,null,"360 AH Battery = 500 Cycles"]
[]
[null,"6a","9001052 battery charger can ONLY be ORDERED when ordering ROLLOUT SYSTEM also."]
[null,"6b","Rollout carts must be ordered separately. When ordering the Rollout Battery System, it is  "]
[null,null,"recommended that the customer upgrades to the 360 AH battery pack.  System does not include batteries."]
[null,null,"Should the customer wish to use their own battery supplier, they have 2 options:"]
[null,null,"a.  Buy batteries to fit in Tennant steel case - see below for internal dimensions."]
[null,null,"b.  Buy their own steel case battery (there is no deduction for this) - see below for external dimensions."]
[null,null,null,null,"Width          Length","Height"]
[null,null,null,"External Dimensions:  ","19.56 in          29.13 in","14.5 in"]
[null,null,null,null,"495 mm          740 mm","370 mm"]
[]
[null,null,null,"Internal Dimensions:  ","19.185 in         28.75 in","14.5 in"]
[null,null,null,null,"485 mm          730 mm","370 mm"]
[null,null,"An extra steel case can be ordered without batteries; part number is 369483."]
[]
[null,7,"Recommend purchase of two (2) 9007087 carts if you do not have a station to roll off the batteries on to. "]
[null,"7a","9008523 Extra Battery Pack (360 AH) in Steel Case for Rollout, may also order two (2) additional with Machine. "]
[]
[null,8,"The battery charger connector is a 50 amp Anderson ( gray ). The battery connector is an Anderson 175 amp connector ( gray )."]
[]
[null,9,"In order to receive the kit offer the kit part # MUST be ordered.  "]
[null,"9a","The On-Board Charger for AGM batteries is a Custom Solution only.  Custom Solutions may add to lead time of unit."]
[]
[null,10,"When ordering the Presweep, the customer can NOT order the RH Sidebrush, Head Light or SE Front Bumper"]
[null,null,"Due to the additional power consumption of the Presweep, it is recommended that the 360 AH batteries be purchased"]
[null,null,"Otherwise, the run-time will ONLY be 1 hour."]
[]
[null,11,"When ordering the dual fans please note that both fans operate and runtime is affected, see note 3"]
[]
[null,12,"Drain Control Valve - is available with dual drains only.  No deduction is available for a single drain."]
[null,null,"The length of hose for the Positive Drain control system is 10 ft (3 m)."]
[]
[null,13,"The 9006922 SE Front Bumper bolts directly to the Frame.  Front Corner Rollers are Removed.   "]
[null,null,"If ordering OHG order 9008060 SE Front Bumper with OHG instead.  "]
[]
[null,14,"When ordering the Overhead Guard, the SE Bumper w/OHG PN 9008060 must also be ordered -Unless ordering Presweep.  "]
[]
[null,15,"A seatbelt is not offered with the basic seat, but the deluxe seat features a retractable seat belt standard."]
[]
[null,16,"A French and English manual will be supplied for all units shipping into Quebec, Canada at no charge.  An additional manual"]
[null,null,"can be ordered (for a total of 3 manuals) for an additional charge as stated under 'Additional Operator Manual'."]
[]
[null,17,"Pre-Paid and Monthly Packages are available for the IRIS Information Service. IRIS Module is required and NOT included in the price of the IRIS Information Service:"]
[null,null,"3 Year Pre-Paid IRIS Information Service                 $350.00"]
[null,null,"5 Year Pre-Paid IRIS Information Service                 $560.00"]
[null,null,"A monthly contract can be set up at $14 per month w/ 12 month minimum commitment."]
[null,null,"IRIS Telemetry Module only covers the price of the hardware. IRIS Telemetry requires an IRIS Telemetry Module and an IRIS Information Service Package."]
[]
[null,18,"CUSTOM PAINT: Customized painting is limited to metal parts only. "]
[null,null,"All non-metal components must remain standard TENNANT colors."]
[null,null,"When selling a Custom Color, you will need to confirm that the color falls within the standard colors "]
[null,null,"available from our powder supplier (50 plus colors to choose from).  Please request a color chart from "]
[null,null,"our Custom Engineering Group Abby Liubakka (x1302) or Larry Juliot (x. 1770)) and obtain the customer's approval.  "]
[null,null,"The order can not be processed without their approval.  If the color is outside this range, it can still be obtained but it will be "]
[null,null,"at an additional charge and will increase the lead time.  For pricing and lead time impact information "]
[null,null,"contact our Custom Engineering Group."]
[null,null,"  When choosing the special paint the following information is needed and must be added to the"]
[null,null,"  Quote Special Instructions section.  Failure to do so will create a two-week delay in your order."]
[null,null," a.  Which parts do you want painted, White parts, green parts, black parts?"]
[null,null,"(unless otherwise agreed upon with Custom Solutions Dept., all white and Tennant teal parts will be painted with custom color)"]
[null,null," b.  Color requested. "]
[]
[null,19,"Shipping Weight and Dimensions","Crate"]
[]
[null,null,"Weight (w/240AH Battery)","2100 lbs / 953 Kg"]
[null,null,"Length","90\" / 2,286 mm"]
[null,null,"Width","55\" / 1,397mm"]
[null,null,"Height","66\" / 1,677 mm"]

{"sheet":"T12","index":14,"n_rows":379,"n_cols":14,"rows_kept":379,"cut":false,"hidden":false,"merged":[[287,2,287,5],[258,3,258,4],[258,5,258,6],[254,3,254,4],[254,5,254,6],[264,1,264,6],[282,4,282,6],[284,2,284,5],[285,2,285,5],[286,2,286,5],[300,2,300,4],[308,4,308,5],[288,2,288,5],[290,2,290,5],[291,2,291,5],[292,2,292,5],[293,2,293,5],[294,2,294,5],[296,4,296,6],[258,7,258,8],[259,3,259,4],[259,5,259,6],[259,7,259,8],[256,3,256,4],[256,5,256,6],[256,7,256,8],[257,3,257,4],[257,5,257,6],[257,7,257,8],[254,7,254,8],[255,3,255,4],[255,5,255,6],[255,7,255,8],[249,3,249,4],[251,3,251,4],[251,5,251,6],[251,7,251,8],[253,3,253,4],[253,5,253,6],[253,7,253,8],[252,3,252,4],[252,5,252,6],[252,7,252,8],[248,3,248,4],[237,3,237,4],[237,5,237,6],[238,3,238,4],[238,5,238,6],[239,3,239,4],[239,5,239,6],[244,4,244,8],[246,3,246,6],[236,3,236,4],[236,5,236,6],[240,3,240,4],[240,5,240,6],[241,3,241,4],[241,5,241,6],[11,2,11,6],[36,1,36,5],[37,1,37,5],[38,1,38,5],[0,2,0,3],[1,2,1,3],[2,2,2,3],[3,2,3,3],[40,1,40,5],[39,1,39,5],[12,1,12,5],[23,1,23,2],[35,1,35,5]]}
["T12",null,{"$f":"Start_Here!$C$8","v":"Contact Name"}]
[null,null,{"$f":"Start_Here!$C$5","v":"Company Name"}]
[null,null,{"$f":"Start_Here!$C$6","v":"Address"}]
[null,null,{"$f":"Start_Here!$C$7","v":"City, State Zip"}]
[null,null,{"$f":"Start_Here!$C$39","v":"Rep Name"}]
[null,null,{"$f":"Start_Here!$C$35","v":"Tennant Sales and Service Company"}]
[null,null,{"$f":"Start_Here!$C$36","v":"701 North Lilac Drive"}]
[null,null,{"$f":"Start_Here!$C$38","v":"Minneapolis, MN 55440-1452"}]
[null,null,{"$f":"Start_Here!$C$41","v":"800-553-8033"},null,"Quote Date :",null,{"$f":"Letter!$A$25","v":"2014-10-02"}]
[]
[]
[]
[null,"BUILT-IN “TENNANT VALUE” INCLUDES:"]
[]
[null,"Wet, 240 AH C/20 Battery Pack",null,"No Tool Squeegee and Brush Change"]
[null,"20 Amp, 115 Volt 60 Hz Charger",null,"In-Line Vacuum Fan Air Filter"]
[null,"Two Speed Electronic Transmission with AC Propel Motor",null,"High Visibility Maintenance Touch Points"]
[null,"Disk or Cylindrcial Scrubbing - 32 in (800 mm) path",null,"Underwriters Laboratory (UL®) \"E\" Certification"]
[null,"Standard Cylindrical or Disk Scrubbing Brushes (Select One)",null,"Cup Holder"]
[null,"Non-Corrosive Duramer™ Solution and Recovery Tanks",null,"Operator Manual and Video"]
[null,null,"35 gal (132 L) Solution Tank","Front and Rear Non-Marking Tires "]
[null,null,"44 gal (166 L) Recovery Tank"]
[null,null,"9 gal (34 L) Demisting Chamber","T12 Controls:"]
[null,"Parabolic Rear Squeegee w/SmartRelease™ Breakaway System",null,"1-Step™ One-Button Scrub Operation"]
[null,"Automatic Functions:",null,"3 Down-Pressure Settings"]
[null,null,"Parking Brake","On Board Diagnostics"]
[null,null,"Squeegee Lift","Water Shutoff Switch"]
[null,null,"Water Shutoff","T12 XP Only Controls and Features:"]
[null,null,"Brush Shutoff When Idle","T12 Controls, plus"]
[null,null,"Brush Shutoff at 80% Battery Discharge","Steering Wheel Mounted, Touch-N-GO Control Module (XP Only)"]
[null,"Two Scrubbing Modes: ec-H2OTM & Conventional Scrubbing",null,"AV Back-up Alarm"]
[null,"ec-H2OTM Cleaning Solution Includes:",null,"Water Shutoff Thumb Switch on Control Module"]
[null,"Electrically Converted Water Technology System",null,"Head and Tail Lights"]
[null,null,null,"Deluxe Seat with Arm Rests"]
[]
[null,"TENNANT COMPANY WARRANTY"]
[null,"36 MONTHS OR 2000 HOURS - PARTS"]
[null,"24 MONTHS - LABOR"]
[null,"6 MONTHS - TRAVEL"]
[null,"10 YEARS ON DURAMERTM TANKS"]
[null,"CUSTOM options may add 1 week or more to standard lead times."]
[]
[]
[]
[]
[]
[null,null,null,null,"                Quote Request Information"]
[null,null,null,null,null,null,"Fax (quote only)"]
[null,null,null,null,null,null,"Mail (quote,lit, specs)"]
[null,null,null,null,null,null,"Fax + Mail"]
[null,null,null,null,"                Primary Use"]
[null,null,null,null,null,null,"Inside"]
[null,null,null,null,null,null,"Outside"]
[]
[null,null,"Description","Reference #","Price Each","Qty","Extended Price"]
[null,"Base Configuration",null,null,"CANADA",{"$f":"SUM(F57,F63,F66,F71,F79,F86)","v":0}]
[null,null,"Cleaning Type",null,null,{"$f":"SUM(F58:F61)","v":0},null,null,null,null,null,{"$f":"SUM(F57)","v":0},"Surcharge Qty"]
[null,null,"T12 Rider - Conventional Disk Scrubbing","T12-D",26074,null,{"$f":"F58*E58","v":0},null,null,null,null,{"$f":"SUM(F58)","v":0},"Surcharge Qty"]
[null,null,"T12 Rider - Conventional Cylindrical Scrubbing","T12-C",26802,null,{"$f":"F59*E59","v":0},null,null,null,null,{"$f":"SUM(F59)","v":0},"Surcharge Qty"]
[null,null,"T12 XP Rider - Conventional Disk Scrubbing","T12-XP-D",28369,null,{"$f":"F60*E60","v":0},null,null,null,null,{"$f":"SUM(F60)","v":0},"Surcharge Qty"]
[null,null,"T12 XP Rider - Conventional Cylindrical Scrubbing","T12-XP-C",29097,null,{"$f":"F61*E61","v":0}]
[]
[null,null,"Cleaning Technology: (conventional is standard, ec-H2O can also operate in conventional mode)",null,null,{"$f":"SUM(F64)","v":0}]
[null,null,"ec-H2O™","ec-H2O-T12",3724,null,{"$f":"F64*E64","v":0}]
[]
[null,null,"Squeegee Material ",null,null,{"$f":"SUM(F67:F69)","v":0}]
[null,null,"Linatex",9009818,"N/C",null,{"$f":"IF(F67=0,\" \",\"N/C\")","v":" "}]
[null,null,"Gum Rubber",9009822,"N/C",null,{"$f":"IF(F68=0,\" \",\"N/C\")","v":" "}]
[null,null,"Urethane",9009820,"N/C",null,{"$f":"IF(F69=0,\" \",\"N/C\")","v":" "}]
[]
[null,null,"Battery Type (Notes 1, 2, 3, 4, & 5)",null,null,{"$f":"SUM(F72:F77)","v":0}]
[null,null,"Wet 240 AH C/20  (Kit of 6 batteries)",9009862,"N/C",null,{"$f":"IF(F72=0,\" \",\"N/C\")","v":" "}]
[null,null,"Wet 360 AH C/20 (in lieu of standard)  (Kit of 6 batteries)",9009863,990,null,{"$f":"F73*E73","v":0}]
[null,null,"Sealed/MF AGM 312AH C/6  (Kit of 6 batteries)",325988,4289,null,{"$f":"F74*E74","v":0}]
[null,null,"Less Battery, DEDUCT",null,-682,null,{"$f":"F75*E75","v":0}]
[]
[null,null,"HydroLink® Battery Watering Kit  (Note 6)",9009620,698,null,{"$f":"F77*E77","v":0}]
[]
[null,null,"Charger (Note 7)","Reference #",null,{"$f":"SUM(F80:F84)","v":0}]
[null,null,"21A 85-265V AC 50/60Hz 1Ph - 240AH Battery off board",9001051,"N/C",null,{"$f":"IF(F80=0,\" \",\"N/C\")","v":" "}]
[null,null,"21A 85-265V AC 50/60Hz 1Ph - 360AH Battery off board",9004241,"N/C",null,{"$f":"IF(F81=0,\" \",\"N/C\")","v":" "}]
[null,null,"20A 85-130V AC 50/60Hz 1Ph (On-board Charger in lieu of standard) ",9009865,770,null,{"$f":"F82*E82","v":0}]
[null,null,"21A 85-265V AC 50/60Hz 1Ph - MF AGM 312AH Battery off-board",314787,700,null,{"$f":"F83*E83","v":0}]
[null,null,"Less Charger, DEDUCT",null,-433,null,{"$f":"F84*E84","v":0}]
[]
[null,null,"UL Rating ",null,null,{"$f":"SUM(F87:F88)","v":0}]
[null,null,"UL® Type E",null,"N/C",null,{"$f":"IF(F87=0,\" \",\"N/C\")","v":" "}]
[null,null,"UL® Type ES",9009908,2674,null,{"$f":"F88*E88","v":0}]
[]
[null,"Packages",null,null,null,{"$f":"SUM(F91:F95)","v":0}]
[null,null,"Heavy Duty Protection Package",9009854,1450,null,{"$f":"F91*E91","v":0}]
[null,null,"Includes:  Front Bumper & Rear Squeegee Protection",null,null,{"$f":"SUM(F91)","v":0}]
[null,null,"Productivity Package",9009855,5139,null,{"$f":"F93*E93","v":0}]
[null,null,"Includes:  Scrubbing Side Brush, Vac Wand, Spray Hose",null,null,{"$f":"SUM(F93)","v":0}]
[null,null,"Safety Light Package",9009909,835,null,{"$f":"F95*E95","v":0}]
[null,null,"Includes:  LED Head Light and AV Backup Alarm w/Strobe Light",null,null,{"$f":"SUM(F95)","v":0}]
[]
[null,"Cleaning Performance",null,"Reference #",null,{"$f":"SUM(F99:F101)","v":0}]
[null,null,"Side Brush, Right Hand Scrubbing",9009824,4092,null,{"$f":"F99*E99","v":0}]
[null,null,"Vacuum  Wand",9010355,806,null,{"$f":"F100*E100","v":0}]
[null,null,"Spray Nozzle with Hose",9009851,1150,null,{"$f":"F101*E101","v":0}]
[]
[null,"Machine Protection & Safety",null,"Reference #",null,{"$f":"SUM(F104:F115)","v":0}]
[null,null,"Heavy Duty Front Bumper",9009856,872,null,{"$f":"F104*E104","v":0}]
[null,null,"Heavy Duty Squeegee Protection",9009858,682,null,0]
[null,null,"Overhead Guard (Includes Heavy Duty Bumper)  (Note 8)",9009860,2270,null,0]
[null,null,"Deluxe Seat (Standard on XP-includes Seat Belt)  (Note 9)",9009835,528,null,0]
[null,null,"Headlight(s) LED (Standard on XP)",9009849,366,null,0]
[null,null,"AV BU Alarm - Strobe on Tank (Standard on XP)",9010352,623,null,0]
[null,null,"Strobe Light on OHG",9010350,623,null,0]
[null,null,"Alternate Strobe Lens (Standard with Amber)",null,null,{"$f":"SUM(F112:F113)","v":0}]
[null,null,"Red",1027798,"N/C",null,{"$f":"IF(F112=0,\" \",\"N/C\")","v":" "}]
[null,null,"Blue",1027800,"N/C",null,{"$f":"IF(F113=0,\" \",\"N/C\")","v":" "}]
[null,null,"Fire Extinguisher",9009878,314,null,{"$f":"F114*E114","v":0}]
[null,null,"Trailer Transport Kit (cover latches for trailering)",9009907,174,null,{"$f":"F115*E115","v":0}]
[]
[null,"Brushes and Pads",null,"Reference #","2016 Price",{"$f":"SUM(F118,F133,F139)","v":0}]
[null,null,"Disk Scrubbing Brushes/Pads (2 Required)",null,null,{"$f":"SUM(F119:F131)","v":0}]
[null,null,"Polypropylene Brush",1220241,"N/C",null,{"$f":"IF(F119=0,\" \",\"N/C\")","v":" "}]
[null,null,"Heavy Duty Polypropylene",1220236,"N/C",null,{"$f":"IF(F120=0,\" \",\"N/C\")","v":" "}]
[null,null,"Nylon Brush",1220235,"N/C",null,{"$f":"IF(F121=0,\" \",\"N/C\")","v":" "}]
[null,null,"Super Abrasive Brush",1221543,381,null,{"$f":"F122*E122","v":0}]
[]
[null,null,"Pad Driver",1220199,"N/C",null,{"$f":"IF(F124=0,\" \",\"N/C\")","v":" "}]
[null,null,"Pads",null,null,{"$f":"SUM(F126:F131)","v":0}]
[null,null,"Brown Stripping - 3M","63248-1",19.600000000000001,null,{"$f":"F126*E126","v":0}]
[null,null,"Blue Scrubbing - 3M     ","63248-2",19.600000000000001,null,0]
[null,null,"Red Cleaning - 3M       ","63248-3",19.600000000000001,null,0]
[null,null,"White Polishing - 3M","63248-4",19.600000000000001,null,0]
[null,null,"Black Stripping - Hi Pro - 3M",370092,31.8,null,0]
[null,null,"Maroon Surface Prep - 3M",1051027,23.8,null,0]
[]
[null,null,"Cylindrical Scrubbing Brushes (2 Required)",null,null,{"$f":"SUM(F134:F137)","v":0}]
[null,null,"Polypropylene Brush",1201572,"N/C",null,{"$f":"IF(F134=0,\" \",\"N/C\")","v":" "}]
[null,null,"Heavy Duty Polypropylene",1201926,"N/C",null,{"$f":"IF(F135=0,\" \",\"N/C\")","v":" "}]
[null,null,"Polyester",1201927,"N/C",null,{"$f":"IF(F136=0,\" \",\"N/C\")","v":" "}]
[null,null,"Super Abrasive Brush",1201928,381,null,{"$f":"F137*E137","v":0}]
[]
[null,null,"Disk Scrubbing Brush/Pad and Sweeping Brush for Side Brush Option (1 Required)",null,"N/C",{"$f":"SUM(F140:F151)","v":0}]
[null,null,"Polypropylene Brush",1220240,"N/C",null,{"$f":"IF(F140=0,\" \",\"N/C\")","v":" "}]
[null,null,"Heavy Duty Polypropylene",1220231,"N/C",null,{"$f":"IF(F141=0,\" \",\"N/C\")","v":" "}]
[null,null,"Nylon Brush",1220230,"N/C",null,{"$f":"IF(F142=0,\" \",\"N/C\")","v":" "}]
[null,null,"Super Abrasive Brush",1220232,381,null,{"$f":"F143*E143","v":0}]
[]
[null,null,"Pad Driver",1220243,"N/C",null,{"$f":"IF(F145=0,\" \",\"N/C\")","v":" "}]
[null,null,"Pads",null,null,{"$f":"SUM(F147:F151)","v":0}]
[null,null,"Brown Stripping - 3M",89046,15.2,null,{"$f":"F147*E147","v":0}]
[null,null,"Blue Scrubbing - 3M     ",89047,15.2,null,{"$f":"F148*E148","v":0}]
[null,null,"Red Cleaning - 3M       ",89048,15.2,null,{"$f":"F149*E149","v":0}]
[null,null,"White Polishing - 3M",89049,15.2,null,{"$f":"F150*E150","v":0}]
[null,null,"Maroon Surface Prep - 3M",1051024,17.8,null,{"$f":"F151*E151","v":0}]
[]
[null,"Support",null,"Reference #",null,{"$f":"SUM(F154:F166)","v":0}]
[null,null,"Standard Warranty",null,"N/C",null,{"$f":"IF(F154=0,\" \",\"N/C\")","v":" "}]
[null,null,"Ultimate Performance Guarantee",50619,"N/C",null,{"$f":"IF(F155=0,\" \",\"N/C\")","v":" "}]
[null,null,"Operator Manual (English)",9009910,"N/C",null,{"$f":"IF(F156=0,\" \",\"N/C\")","v":" "}]
[null,null,"Operator Manual (Spanish)  ",9009911,"N/C",null,{"$f":"IF(F157=0,\" \",\"N/C\")","v":" "}]
[null,null,"Operator Manual (French)  (Note 10)",9009912,"N/C",null,{"$f":"IF(F158=0,\" \",\"N/C\")","v":" "}]
[null,null,"Additional Operator Manual","Select from Above",53.2,null,{"$f":"F159*E159","v":0}]
[null,null,"Parts Manual",9009916,"N/C"]
[null,null,"Additional Parts Manual",9009916,89.6,null,{"$f":"F161*E161","v":0}]
[null,null,"Operator DVD (English, Spanish, French) Verify Languages",9009890,"N/C",null,{"$f":"IF(F162=0,\" \",\"N/C\")","v":" "}]
[null,null,"Additional Operator Video",9009890,42,null,{"$f":"F163*E163","v":0}]
[null,null,"Service Manual",9009917,182,null,{"$f":"F164*E164","v":0}]
[]
[null,null,"Packaging  (Note 12)",null,null,{"$f":"SUM(F167)","v":0}]
[null,null,"Skid w/Carton, Non-Stackable",9009900,"N/C",null,{"$f":"IF(F167=0,\" \",\"N/C\")","v":" "}]
[]
[null,"AFTERMARKET ITEMS (ordered separately) :",null,null,null,{"$f":"SUM(F171)","v":0}]
[]
[null,"Brushes and Pads (Replacements)",null,"Reference #","Price",{"$f":"SUM(F172,F187,F193)","v":0}]
[null,null,"Disk Scrubbing Brushes/Pads (2 Required)",null,null,{"$f":"SUM(F173:F185)","v":0}]
[null,null,"Polypropylene Brush",1220241,261.8,null,{"$f":"F173*E173","v":0}]
[null,null,"Heavy Duty Polypropylene",1220236,284.89999999999998,null,{"$f":"F174*E174","v":0}]
[null,null,"Soft Nylon Brush",1220235,352,null,{"$f":"F175*E175","v":0}]
[null,null,"Super Abrasive Brush",1221543,475.5,null,{"$f":"F176*E176","v":0}]
[]
[null,null,"Pad Driver",1220199,393.90000000000003,null,{"$f":"F178*E178","v":0}]
[null,null,"Pads",null,null,{"$f":"SUM(F180:F185)","v":0}]
[null,null,"Brown Stripping - 3M","63248-1",19.600000000000001,null,{"$f":"F180*E180","v":0}]
[null,null,"Blue Scrubbing - 3M     ","63248-2",19.600000000000001,null,0]
[null,null,"Red Cleaning - 3M       ","63248-3",19.600000000000001,null,0]
[null,null,"White Polishing - 3M","63248-4",19.600000000000001,null,0]
[null,null,"Black Stripping - Hi Pro - 3M",370092,31.8,null,0]
[null,null,"Maroon Surface Prep - 3M",1051027,23.8,null,0]
[]
[null,null,"Cylindrical Scrubbing Brushes (2 Required)",null,null,{"$f":"SUM(F188:F191)","v":0}]
[null,null,"Polypropylene Brush",1201572,215.79999999999998,null,{"$f":"F188*E188","v":0}]
[null,null,"Heavy Duty Polypropylene",1201926,215.9,null,{"$f":"F189*E189","v":0}]
[null,null,"Polyester",1201927,296.60000000000002,null,{"$f":"F190*E190","v":0}]
[null,null,"Super Abrasive Brush",1201928,418.40000000000003,null,{"$f":"F191*E191","v":0}]
[]
[null,null,"Disk Scrubbing Brush/Pad and Sweeping Brush for Side Brush Option (1 Required)",null,null,{"$f":"SUM(F194:F205)","v":0}]
[null,null,"Polypropylene Brush",1220240,233.29999999999998,null,{"$f":"F194*E194","v":0}]
[null,null,"Heavy Duty Polypropylene",1220231,253.9,null,{"$f":"F195*E195","v":0}]
[null,null,"Soft Nylon Brush",1220230,284.5,null,{"$f":"F196*E196","v":0}]
[null,null,"Super Abrasive Brush",1220232,423.5,null,{"$f":"F197*E197","v":0}]
[]
[null,null,"Pad Driver",1220243,308.60000000000002,null,{"$f":"F199*E199","v":0}]
[null,null,"Pads",null,null,{"$f":"SUM(F201:F205)","v":0}]
[null,null,"Brown Stripping - 3M",89046,15.2,null,{"$f":"F201*E201","v":0}]
[null,null,"Blue Scrubbing - 3M     ",89047,15.2,null,0]
[null,null,"Red Cleaning - 3M       ",89048,15.2,null,0]
[null,null,"White Polishing - 3M",89049,15.2,null,0]
[null,null,"Maroon Surface Prep - 3M",1051024,17.8,null,0]
[]
[null,"Maintenance Items",null,"Reference #",null,{"$f":"SUM(F208:F223)","v":0}]
[null,null,"Squeegee Blade, Linard®, Front",1200383,33.800000000000004,null,0]
[null,null,"Squeegee Blade, Linatex®, Rear",1200384,48.9,null,{"$f":"F209*E209","v":0}]
[null,null,"Squeegee Blade, Gum Rubber, Front",1201825,19.8,null,0]
[null,null,"Squeegee Blade, Gum Rubber, Rear",1201826,31.3,null,0]
[null,null,"Squeegee Blade, Urethane, Front",1201823,60.1,null,0]
[null,null,"Squeegee Blade, Urethane, Rear",1201824,81.8,null,0]
[null,null,"Side Squeegee Blade, Linatex® (Order 2)",1200430,44.300000000000004,null,0]
[null,null,"Side Squeegee Blade, Gum Rubber (Order 2)",1202160,30.400000000000002,null,0]
[null,null,"Side Squeegee Blade, Urethane (Order 2)",1202159,67.8,null,0]
[null,null,"Squeegee Wheel",363162,26.8,null,0]
[null,null,"Squeegee Caster Wheel (Order 2)",1205850,100.3,null,0]
[null,null,"Squeegee Hose",1201875,50,null,0]
[null,null,"Squeegee Hose with Vac Wand",1200642,107.3,null,0]
[null,null,"Front Skirt (Disk Only)",1201053,13.799999999999999,null,0]
[null,null,"Rear Skirt (Disk Only)",1201127,11.799999999999999,null,0]
[null,null,"Filter, Panel",1037821,21.5,null,0]
[]
[null,"Custom Solution--write in description, qty, price, and PN if applicable",null,null,null,{"$f":"SUM(F226)","v":0}]
[null,null,null,null,"Insert Prices Here",{"$f":"SUM(F227:F230)","v":0}]
[null,null,null,"Custom",null,{"$f":"IF(E227 <> \"\", 1, 0)","v":0},{"$f":"F227*E227","v":0}]
[null,null,null,"Custom",null,{"$f":"IF(E228 <> \"\", 1, 0)","v":0},{"$f":"F228*E228","v":0}]
[null,null,null,"Custom",null,{"$f":"IF(E229 <> \"\", 1, 0)","v":0},{"$f":"F229*E229","v":0}]
[null,null,null,"Custom",null,{"$f":"IF(E230 <> \"\", 1, 0)","v":0},{"$f":"F230*E230","v":0}]
[null,null,"Prepaid and Add","Freight",null,1,{"$f":"F231*E231","v":0}]
[null,null,"Subject to all applicable taxes","Tax",null,1,{"$f":"F232*E232","v":0}]
[]
[null,null,null,"MACHINE TOTAL*",null,null,{"$f":"SUM(G58:G232)","v":0},null,null,null,null,null,null,"This goes to \"My Documents\""]
[null,null,null,null,null,null,{"$f":"SUM(G234)","v":0}]
[]
[null,null,"National Leasing - Leasing Calculation Option:","Finance Option 1",null,"Finance Option 2",null,null,{"$f":"Financing!A38","v":"Rates 2016 - Rev. 7/1/2016"}]
[null,null,"Purchase Option:",1,null,"FMV Scrubber",null,null,{"$f":"Financing!A39","v":"“Blank Payment Amounts Indicate The Financing Option Or Purchase Options Selected Are Not "}]
[null,null,"24 Months",0,null,0,null,null,{"$f":"Financing!A40","v":"Applicable Or The Machine Total Is Below The Minimum Amount For The Selected Vendor”"}]
[null,null,"36 Months",0,null,0,null,null,{"$f":"Financing!A41","v":"\"Quoted monthly payments are estimates only and are based on a certain level of credit rating."}]
[null,null,"48 Months",0,null,0,null,null,{"$f":"Financing!A42","v":"Actual monthly payments may be higher depending on your credit rating.\""}]
[null,null,"60 Months",0,null,0,null,null,{"$f":"Financing!A43","v":"“Financing rates do not include Pre-Paid Service”"}]
[null,"   TennantTrue",null,null,0,0]
[]
[null,null,"Is customer interested in service program?","Yes","*State/County selection required for TennantTrue service options"]
[]
[null,null,"If not, why?"]
[]
[null,null,"Term:",36,null,null,"AB Brushes","No"]
[null,null,"Monthly machine usage (hrs):",25]
[]
[null,null,"TennantTrue: ","Rate Per Unit",null,"Hourly Labor Rate",null,"Site Visit Charge"]
[null,null,"Gold - Monthly",110]
[null,null,"Gold - Pre Pay Full Term",3683]
[null,null,"Silver - Monthly",64]
[null,null,"Silver - Annually",755]
[null,null,"Silver - Pre Pay Full Term",2217]
[null,null,"Silver - Per Visit",365]
[null,null,"Pay As You Go",null,null,null,null,null,null,null,"*State/County selection required for 'Pay As You Go' and 'On Demand'."]
[null,null,"On Demand"]
[]
[]
[]
[null,"Quote Special Instructions:"]
[]
[]
[null,{"$f":"Start_Here!E33","v":"Terms and Conditions"}]
[null,{"$f":"Start_Here!E34","v":"Ask your local sales rep for estimated lead times. Verify when placing order"}]
[null,{"$f":"Start_Here!E35","v":"All orders subject to acceptance by Tennant Sales and Service Company, Minneapolis, Minnesota"}]
[null,{"$f":"Start_Here!E36","v":"Prices subject to change without notice. Subject to any applicable taxes."}]
[null,{"$f":"Start_Here!E37","v":"Terms:  Net 30 days.  Payable in Canadian Funds"}]
[null,{"$f":"Start_Here!E38","v":"Freight:  Accessories, parts, supplies, detergents, and floor coatings orders delivered DDP "}]
[null,{"$f":"Start_Here!E39","v":"shipping point Frt PPD.  Machine orders delivered DDP shipping point Frt PPD and add."}]
[null,{"$f":"Start_Here!E40","v":"Returned Merchandise is subject to a restocking fee."}]
[null,{"$f":"Start_Here!E42","v":"Printed General Terms and Conditions are also available upon request."}]
[null,{"$f":"Start_Here!E43","v":0}]
[]
[null,null,null,null,"Quote Date :",null,{"$f":"Letter!$A$25","v":"2014-10-02"}]
["Order Placement Information:  To place your order, fill in PO# and customer signatures,"]
["call or fax to the numbers listed below. Customer Purchase Order is required."]
["If information is missing, orders will be entered and held until all information is received."]
[null,null,"Customer Number",null,{"$f":"Start_Here!F15","v":"Cust Grp 3"}]
[null,null,{"$f":"Start_Here!$F$5","v":0},null,{"$f":"Start_Here!F16","v":0}]
[null,null,{"$f":"Start_Here!$B$18","v":"Sold To Information (Please Verify)"}]
["Company",null,{"$f":"Start_Here!$C$19","v":""}]
["Address",null,{"$f":"Start_Here!$C$20","v":""}]
[null,null,{"$f":"Start_Here!$C$21","v":""}]
["Name",null,{"$f":"Start_Here!$C$22","v":""}]
["Phone",null,{"$f":"Start_Here!$C$23","v":""}]
[null,null,{"$f":"Start_Here!$B$11","v":"Ship To Information (Please Verify)"}]
["Company",null,{"$f":"Start_Here!$C$12","v":""}]
["Address",null,{"$f":"Start_Here!$C$13","v":""}]
[null,null,{"$f":"Start_Here!$C$14","v":""}]
["Name",null,{"$f":"Start_Here!$C$15","v":""}]
["Phone",null,{"$f":"Start_Here!$C$16","v":""}]
[null,null,{"$f":"Start_Here!$B$25","v":"Shipping/Carrier Instructions:"},null,"Order Special Instructions:"]
[null,null,{"$f":"Start_Here!$C$26","v":0}]
[]
[null,null," Customer Purchase Order No. "]
[null,null," (please attach copy) "]
[]
[]
[null,null," Tax Exempt ",null," Yes "]
[null,null,null,null," No "]
[null,null," If Yes, attach a copy of your exemption certificate. "]
[]
[null,null," Requested Delivery Date "]
[null,null,{"$f":"Start_Here!$F$14","v":0}]
[null,null,{"$f":"Start_Here!$F$8","v":0},null,{"$f":"Start_Here!$F$11","v":0}]
[null,null," Authorized Buyer (please print) ",null," Phone Number "]
[]
[null,null," Authorized Buyer Signature "]
[]
[null,null,"Tennant Representative"]
["Specialized Maintenance Equipment"]
[]
[]
[]
[]
[null,"SPECIAL INFORMATION"]
[]
[null,1,"The battery compartment will fit six 6-volt batteries of this size:",null,"Length       Width","Height"]
[null,null,"Battery Size",null,"11.70 in      6.95 in","14.38 in"]
[null,null,null,null,"297 mm     177 mm","365 mm"]
[]
[null,2,"Overall Battery Compartment Size:",null,"Length       Width","Height"]
[null,null,"(these are the \"full compartment\" dimensions, allow space on top ",null,"21.5 in     23.89 in","15.5 in"]
[null,null,"of battery for watering system clearance, etc)",null,"545 mm      605 mm","390 mm"]
[]
[null,3,"Model T12 Continuous Runtime Chart.",null,"Standard","High"]
[null,null,null,null,"Capacity","Capacity"]
[null,null,null,null,"240AH","360AH"]
[null,null,"T12 Base Unit (economy mode, main scrub only)",null,"2.9 hours","4.5 hours"]
[null,null,"T12 Base Unit with RH Sidebrush ( economy mode ) ",null,"2.4 hours","3.8 hours"]
[null,null,"The above runtimes are guidelines.  Actual times will vary based on floor conditions, final machine configuration & usage"]
[]
[null,4,"To calculate weights with batteries add the following to the product “Net” or “Ship” weights:"]
[null,null,"240 AH Battery Pack = + 6 Batteries @ 67 lbs (30.4kg) each = 402 lbs (182.5 kg)"]
[null,null,"360 AH Battery Pack = + 6 Batteries @ 98 lbs (45 kg) each = 588 lbs (267 kg)"]
[]
[null,5,"Expected Cycle Life:  Cycle life is the number of charge cycles a battery is expected to last."]
[null,null,"240 AH Battery = 500 Cycles"]
[null,null,"360 AH Battery = 500 Cycles"]
[]
[null,6,"ONLY available with Wet (Lead Acid) batteries.  Cannot be used with Sealed Gel / AGM Batteries."]
[]
[null,7,"The battery charger connector is a 50 amp Anderson ( gray ). The battery connector is an Anderson 175 amp connector ( gray )."]
[]
[null,8,"The 9009856 SE Front Bumper bolts directly to the Frame.    "]
[null,null,"If ordering OHG order 9009848 SE Front Bumper with OHG instead.  "]
[]
[null,9,"A seatbelt is not offered with the basic seat, but the deluxe seat features a retractable seat belt standard."]
[null,null,"at an additional charge and will increase the lead time.  For pricing and lead time impact information "]
[null,null,"contact our Custom Engineering Group."]
[]
[null,10,"A French and English manual will be supplied for all units shipping into Quebec, Canada at no charge.  An additional manual"]
[null,null,"can be ordered (for a total of 3 manuals) for an additional charge as stated under 'Additional Operator Manual'."]
[]
[null,15,"Pre-Paid and Monthly Packages are available for the IRIS Information Service. IRIS Module is required and NOT included in the price of the IRIS Information Service:"]
[null,null,"3 Year Pre-Paid IRIS Information Service                 $350.00"]
[null,null,"5 Year Pre-Paid IRIS Information Service                 $560.00"]
[null,null,"A monthly contract can be set up at $14 per month w/ 12 month minimum commitment."]
[null,null,"IRIS Telemetry Module only covers the price of the hardware. IRIS Telemetry requires an IRIS Telemetry Module and an IRIS Information Service Package."]
[]
[null,12,"Skid w/Carton, Non-Stackable is the default packaging method and will be added to the configuration unless otherwise specified."]
[null,null,"The Skid w/Carton, Non-Stackable (PN 9009900) includes the crate and all bracketry for shipping."]
[]
[null,13,"When choosing the special paint the following information is needed and must be added to the"]
[null,null,"Quote Special Instructions section.  Failure to do so will create a two-week delay in your order."]
[null,null," a.  Which parts do you want painted, White parts, green parts, black parts?"]
[null,null,"(unless otherwise agreed upon with Custom Solutions Dept., all white and Tennant teal parts will be painted with custom color)"]
[null,null," b.  Color requested. "]
[]
[null,14,"Shipping Weights and Dimensions","Skid w/Carton"]
[]
[null,null,"Weight  (w/240AH Batteries)","2200 lbs / 998 Kg"]
[null,null,"Length","85\" / 2159 mm"]
[null,null,"Width","46\" / 1169 mm"]
[null,null,"Height","63\" / 1600 mm"]

{"sheet":"M17","index":15,"n_rows":453,"n_cols":13,"rows_kept":453,"cut":false,"hidden":false,"merged":[[308,2,308,5],[276,3,276,4],[276,5,276,6],[26,2,26,6],[27,2,27,6],[28,2,28,6],[29,2,29,6],[30,2,30,6],[302,2,302,5],[303,2,303,5],[304,2,304,5],[305,2,305,5],[307,2,307,5],[272,3,272,4],[272,5,272,6],[269,3,269,4],[326,4,326,5],[309,2,309,5],[310,2,310,5],[311,2,311,5],[313,4,313,7],[315,3,315,4],[317,2,317,4],[276,7,276,8],[281,2,281,7],[299,4,299,7],[301,2,301,5],[274,3,274,4],[274,5,274,6],[274,7,274,8],[275,3,275,4],[275,5,275,6],[275,7,275,8],[272,7,272,8],[273,3,273,4],[273,5,273,6],[273,7,273,8],[270,3,270,4],[270,5,270,6],[270,7,270,8],[271,3,271,4],[271,5,271,6],[271,7,271,8],[269,5,269,6],[269,7,269,8],[257,3,257,4],[257,5,257,6],[258,3,258,4],[258,5,258,6],[261,4,261,8],[263,3,263,6],[265,3,265,4],[266,3,266,4],[268,3,268,4],[268,5,268,6],[268,7,268,8],[254,3,254,4],[254,5,254,6],[255,3,255,4],[255,5,255,6],[256,3,256,4],[256,5,256,6],[253,5,253,6],[244,2,244,3],[245,2,245,3],[246,2,246,3],[247,2,247,3],[248,2,248,3],[253,3,253,4],[243,2,243,3],[0,2,0,3],[1,2,1,3],[2,2,2,3],[3,2,3,3],[11,1,11,5],[31,2,31,6]]}
["M17",null,{"$f":"Start_Here!$C$8","v":"Contact Name"}]
[null,null,{"$f":"Start_Here!$C$5","v":"Company Name"}]
[null,null,{"$f":"Start_Here!$C$6","v":"Address"}]
[null,null,{"$f":"Start_Here!$C$7","v":"City, State Zip"}]
[null,null,{"$f":"Start_Here!$C$39","v":"Rep Name"}]
[null,null,{"$f":"Start_Here!$C$35","v":"Tennant Sales and Service Company"}]
[null,null,{"$f":"Start_Here!$C$36","v":"701 North Lilac Drive"}]
[null,null,{"$f":"Start_Here!$C$38","v":"Minneapolis, MN 55440-1452"}]
[null,null,{"$f":"Start_Here!$C$41","v":"800-553-8033"},null,"Quote Date :",null,null,{"$f":"Letter!$A$25","v":"2014-10-02"}]
[]
[]
[null,"BUILT-IN “TENNANT VALUE” INCLUDES:"]
[]
[null,null,"1-Step™ One Button Operation ",null,"3.0 ft3 / 85 L Hopper Volume Capacity"]
[null,null,"Touch-N-Go™ Wheel Mounted Module ",null,"60\" / 1525 mm Hopper Dump Height"]
[null,null,"Recover Tank Full & Solution Tank Empty Indicator",null,"Onboard Diagnostics"]
[null,null,"Non Marking Drive Wheel ",null,"Steering Wheel Mounted Horn"]
[null,null,"Yellow Maintenance Touch Points ",null,"Steering Wheel Mounted Water Shut-Off"]
[null,null,"Recovery Tank Debris Tray",null,"Maintenance Free Scrub Brush, Propel, & Dust Control Vac Fan Motors"]
[null,null,"In-Line Vacuum Fan Filter",null,"Duramer™ Tanks & Shrouds"]
[null,null,"Tracking Rear Parabolic Squeegee ",null,"Variable Flow Tank Drains"]
[null,null,"SmartRelease™ Breakaway Rear Squeegee",null,"No-Tool Squeegee Change"]
[null,null,"Underwriters Laboratory (UL®) E Certified",null,"No-Tool Brush Change"]
[null,null,"Dual Side Sweeping Brushes",null,"Full Wrap Steel Bumper with Front Cushioned Corner Rollers"]
[]
[]
[null,null,"TENNANT COMPANY WARRANTY"]
[null,null,"36 MONTHS OR 2000 HOURS - PARTS"]
[null,null,"24 MONTHS - LABOR"]
[null,null,"6 MONTHS - TRAVEL"]
[null,null,"10 YEARS ON DURAMERTM TANKS"]
[null,null,"CUSTOM options may add 1 week or more to standard lead times."]
[]
[]
[null,null,null,null,null," Quote Request Information"]
[null,null,null,null,null,null,null,"Fax (quote only)"]
[null,null,null,null,null,null,null,"Mail (quote,lit,"]
[null,null,null,null,null,null,null,"          specs)"]
[null,null,null,null,null,null,null,"Fax + Mail"]
[null,null,null,null,null,"                Primary Use"]
[null,null,null,null,null,null,null,"Inside"]
[null,null,null,null,null,null,null,"Outside"]
[]
[]
[null,null,"Description",null,"Reference #","Price Each","Qty","Extended Pr"]
[null,null,null,null,null,null,"*"]
[null,"Base Configuration",null,null,null,"CANADA",{"$f":"SUM(G48,,G52,G56,G60,G65,G74,G77,G85,G93)","v":0}]
[null,null,"Cleaning Type",null,null,null,{"$f":"SUM(G49:G50)","v":0}]
[null,null,"M17 Disk Conventional Scrubber / Sweeper",null,"M17-D",59009.999999999993,null,{"$f":"G49*F49","v":0}]
[null,null,"M17 Cylindrical Conventional Scrubber / Sweeper  (Note 1)",null,"M17-C",59709.999999999993,null,{"$f":"G50*F50","v":0}]
[]
[null,null,"Trim Level",null,null,"Price",{"$f":"SUM(G53:G54)","v":0}]
[null,null,"Membrane Panel",null,"MCP - M17","N/C",null,{"$f":"IF(G53=0,\" \",\"N/C\")","v":" "}]
[null,null,"Pro-Panel  (Note 2)",null,"P - M17",2730,null,{"$f":"G54*F54","v":0}]
[]
[null,null,"Cleaning Technology: (conventional is standard,  ec-H2O: can also operate in conventional mode)",null,null,"Price",{"$f":"SUM(G57:G58)","v":0}]
[null,null,"ES  (Note 3)",null,"ES-M17",3859,null,{"$f":"G57*F57","v":0}]
[null,null,"ec-H2O w/ S.E. Switch",null,"ecH2O-M17",4298,null,0]
[]
[null,null,"Squeegee Material",null,null,"Price",{"$f":"SUM(G61:G63)","v":0}]
[null,null,"Linatex",null,"LTX-M17","N/C",null,{"$f":"IF(G61=0,\" \",\"N/C\")","v":" "}]
[null,null,"Gum Rubber",null,"GUM-M17","N/C",null,{"$f":"IF(G62=0,\" \",\"N/C\")","v":" "}]
[null,null,"Urethane",null,"URE-M17","N/C",null,{"$f":"IF(G63=0,\" \",\"N/C\")","v":" "}]
[]
[null,null,"Battery  (Note 4-7)",null,null,"Price",{"$f":"SUM(G66:G72)","v":0}]
[null,null,"Wet 510AH C/6",null,9020112,5067,null,{"$f":"G66*F66","v":0}]
[null,null,"Wet 750AH C/6",null,9020113,6100,null,0]
[null,null,"Wet Tubular 930AH C/6",null,9020114,9257,null,0]
[null,null,"Wet Tubular 930AH C/6 OC (Single Point Watering and Wi-IQ Monitor) *Opportunity charger required",null,9017261,10150,null,0]
[null,null,"Without",null,null,"N/C",null,{"$f":"IF(G70=0,\" \",\"N/C\")","v":" "}]
[]
[null,null,"Battery Watering System  (Note 8) ",null,"WTR-M17",665,null,{"$f":"G72*F72","v":0}]
[]
[null,null,"Battery Exchange System  (Note 9-10)",null,null,"Price",{"$f":"SUM(G75)","v":0}]
[null,null,"Battery Slide Out",null,9020125,1077,null,{"$f":"G75*F75","v":0}]
[]
[null,null,"Additional Battery",null,null,null,{"$f":"SUM(G78:G83)","v":0}]
[null,null,"Wet 510AH C/6",null,1207937,6484,null,{"$f":"G78*F78","v":0}]
[null,null,"Wet 750AH C/6",null,1207938,7842,null,0]
[null,null,"Wet Tubular 930AH C/6",null,1210313,11858,null,0]
[null,null,"Wet 510AH C/6 with Watering Kit",null,1210314,7016,null,0]
[null,null,"Wet 750AH C/6 with Watering Kit",null,1210315,8371,null,0]
[null,null,"Wet Tubular 930AH C/6 with Watering Kit",null,1210316,12388,null,{"$f":"G83*F83","v":0}]
[]
[null,null,"Charger  (Note 11-14)",null,"Reference Number","Price",{"$f":"SUM(G86:G91)","v":0}]
[null,null,"80A 200-240VAC 50/60Hz 1Ph - For 510AH Battery",null,1207933,2943,null,{"$f":"G86*F86","v":0}]
[null,null,"80A 200-240VAC 50/60Hz 3Ph - For 510AH Battery",null,1207934,3660,null,0]
[null,null,"100A 200-240V AC 50/60Hz 3Ph - For 750AH and 930AH Battery",null,1212158,3517,null,0]
[null,null,"160A 600V AC 50/60Hz 3Ph - For All Batteries",null,316597,6300,null,{"$f":"G89*F89","v":0}]
[null,null,"240A 480V AC 50/60Hz 3Ph - Opportunity Charger for 930AH Battery ",null,1219396,5530,null,0]
[null,null,"Without Charger",null,null,"N/C",null,{"$f":"IF(G91=0,\" \",\"N/C\")","v":" "}]
[]
[null,null,"UL Rating ",null,"Reference Number","Price",{"$f":"SUM(G94:G95)","v":0}]
[null,null,"UL Type E",null,null,"N/C",null,{"$f":"IF(G94=0,\" \",\"N/C\")","v":" "}]
[null,null,"UL Type ES",null,null,3610,null,{"$f":"G95*F95","v":0}]
[]
[null,"Packages",null,null,"Reference Number","Price",{"$f":"SUM(G98:G100)","v":0}]
[null,null,"Productivity Package  (Note 15)",null,"PRD-M17",4969,null,{"$f":"G98*F98","v":0}]
[null,null,"Scrubbing Side Brush, Spary Nozzle w/Hose, and Vacuum Wand OR Live Wand"]
[null,null,"Safety Light Package",null,"SFY-M17",840,null,{"$f":"G100*F100","v":0}]
[null,null,"LED Headlights and AV Back Up Alarm w/Strobe"]
[]
[null,"Cleaning Performance",null,null,"Reference Number","Price",{"$f":"SUM(G104:G113)","v":0}]
[null,null,"Scrubbing Side Brush",null,9017121,4093,null,{"$f":"G104*F104","v":0}]
[null,null,"Side Brush Dust Control - Sweeping Side Brooms",null,9017135,2485,null,0]
[null,null,"Vacuum Wand WET",null,9020079,604,null,0]
[null,null,"Spray Nozzle w/Hose",null,9020075,1151,null,0]
[null,null,"Auto Fill  (Note 16)",null,9020090,539,null,0]
[null,null,"Recovery Tank Drain - Drain Control Valve  (Note 17)",null,9020092,727,null,0]
[null,null,"Severe Environment Switch - DEDUCT",null,null,-574,null,0]
[]
[null,null,"Detergent",null,null,null,{"$f":"SUM(G113)","v":0}]
[null,null,"Solvent Based Degreaser, 5 Gal",null,9006770,"N/C",null,{"$f":"IF(G113=0,\" \",\"N/C\")","v":" "}]
[null,null,null,null,null,null,{"$f":"SUM(G115:G116)","v":0}]
[null,"Machine Protection & Safety",null,null,"Reference Number","Price",{"$f":"SUM(G116:G128)","v":0}]
[null,null,"Heavy Duty Squeegee Protection",null,9020025,682,null,{"$f":"G116*F116","v":0}]
[null,null,"Overhead Guard",null,9020028,1962,null,0]
[null,null,"Deluxe Seat (in lieu of standard)",null,9020102,530,null,0]
[null,null,"High Traction, Non-Marking Rear Tires",null,9020021,322,null,0]
[null,null,"Headlights - LED",null,9017205,367,null,0]
[null,null,"AV BU Alarm-Strobe on Tank  (Note 18)",null,9020108,622,null,0]
[null,null,"Strobe Light on OHG  (Note 18)",null,9020106,432,null,0]
[null,null,"Alternate Strobe/Flashing Lens",null,null,null,{"$f":"SUM(G124:G125)","v":0}]
[null,null,"Red",null,1027798,"N/C",null,{"$f":"IF(G124=0,\" \",\"N/C\")","v":" "}]
[null,null,"Blue",null,1027800,"N/C",null,{"$f":"IF(G125=0,\" \",\"N/C\")","v":" "}]
[null,null,"Clogged Filter Indicator",null,9017159,489.99999999999994,null,{"$f":"G126*F126","v":0}]
[null,null,"Fire Extinguisher",null,9020138,315,null,0]
[null,null,"Trailer Transport Kit",null,9017164,181,null,0]
[]
[null,"Brushes and Pads",null,null,"Reference Number","Price",{"$f":"SUM(G131,G144,G149,)","v":0}]
[null,null,"Scrubbing Brushes/Pads (2 Required)",null,null,null,{"$f":"SUM(G132:G142)","v":0}]
[null,null,"Polypropylene Brush",null,1220192,"N/C",null,{"$f":"IF(G132=0,\" \",\"N/C\")","v":" "}]
[null,null,"Nylon Brush",null,1220193,"N/C",null,{"$f":"IF(G133=0,\" \",\"N/C\")","v":" "}]
[null,null,"Super Abrasive Brush",null,1220194,391,null,{"$f":"G134*F134","v":0}]
[]
[null,null,"Pad Driver",null,1220201,"N/C",null,{"$f":"IF(G136=0,\" \",\"N/C\")","v":" "}]
[null,null,"Pads",null,null,null,{"$f":"SUM(G138:G142)","v":0}]
[null,null,"Brown Stripping - 3M",null,17263,25.5,null,{"$f":"G138*F138","v":0}]
[null,null,"Blue Scrubbing - 3M",null,17262,25.5,null,0]
[null,null,"Red Cleaning - 3M",null,17261,25.5,null,0]
[null,null,"White Polishing - 3M",null,17260,25.5,null,0]
[null,null,"Black Stripping-Hi Pro - 3M",null,370094,28.5,null,0]
[]
[null,null,"Cylindrical Scrubbing Brushes (2 Required)",null,null,null,{"$f":"SUM(G145:G147)","v":0}]
[null,null,"Polypropylene Brush",null,386230,"N/C",null,{"$f":"IF(G145=0,\" \",\"N/C\")","v":" "}]
[null,null,"Nylon Brush",null,386250,"N/C",null,{"$f":"IF(G146=0,\" \",\"N/C\")","v":" "}]
[null,null,"Super Abrasive Brush",null,386240,391,null,{"$f":"G147*F147","v":0}]
[]
[null,null,"Side Scrubbing Brushes/Pads (1 Required)",null,null,null,{"$f":"SUM(G150:G159)","v":0}]
[null,null,"Polypropylene Brush",null,1220240,"N/C",null,{"$f":"IF(G150=0,\" \",\"N/C\")","v":" "}]
[null,null,"Nylon Brush",null,1220230,"N/C",null,{"$f":"IF(G151=0,\" \",\"N/C\")","v":" "}]
[null,null,"Super Abrasive Brush",null,1220232,317,null,{"$f":"G152*F152","v":0}]
[null,null,null,null,null,null,null,{"$f":"IF(G153=0,\" \",\"N/C\")","v":" "}]
[null,null,"Pad Driver",null,1220243,"N/C",null,{"$f":"IF(G154=0,\" \",\"N/C\")","v":" "}]
[null,null,"Pads",null,null,null,{"$f":"SUM(G156:G159)","v":0}]
[null,null,"Brown Stripping - 3M",null,89046,15.2,null,{"$f":"G156*F156","v":0}]
[null,null,"Blue Scrubbing - 3M",null,89047,15.2,null,0]
[null,null,"Red Cleaning - 3M",null,89048,15.2,null,0]
[null,null,"White Polishing - 3M",null,89049,15.2,null,0]
[]
[null,"Support",null,null,"Reference Number","Price",{"$f":"SUM(G162:G174)","v":0}]
[null,null,"M17 Operator Manual - English",null,9017351,"N/C",null,{"$f":"IF(G162=0,\" \",\"N/C\")","v":" "}]
[null,null,"M17 Operator Manual - French  (Note 19)",null,9017352,"N/C",null,{"$f":"IF(G163=0,\" \",\"N/C\")","v":" "}]
[null,null,"M17 Operator Manual - Spanish",null,9017353,"N/C",null,{"$f":"IF(G164=0,\" \",\"N/C\")","v":" "}]
[null,null,"Additional Operator Manual",null,"SEE ABOVE",139,null,{"$f":"G165*F165","v":0}]
[null,null,"Operator Video",null,9017386,"N/C",null,{"$f":"IF(G166=0,\" \",\"N/C\")","v":" "}]
[null,null,"Service manual",null,9017358,182,null,0]
[null,null,"M17 Parts Manual",null,9017357,"N/C",null,{"$f":"IF(G168=0,\" \",\"N/C\")","v":" "}]
[null,null,"Additional Parts Manual (Aftermarket Only)",null,"SEE ABOVE",90,null,{"$f":"G169*F169","v":0}]
[]
[null,null,"Machine Communication  (Note 20)",null,null,null,{"$f":"SUM(G172)","v":0}]
[null,null,"IRIS Telemetry Module",null,9017312,1323,null,{"$f":"G172*F172","v":0},{"$f":"IF(G172=0,\"\",\"Please select a required package in the IRIS Machine Communication below.\")","v":""}]
[]
[null,null,"Packaging",null,null,"Price",{"$f":"SUM(G175)","v":0}]
[null,null,"Skid",null,9017320,"N/C",null,{"$f":"IF(G175=0,\" \",\"N/C\")","v":" "}]
[]
[]
[null,"AFTERMARKET ITEMS (ordered separately) :",null,null,null,null,{"$f":"SUM(G180)","v":0}]
[]
[null,"Brushes and Pads (Replacements)",null,null,"Reference Number","Price",{"$f":"SUM(G181,G194,G199,G211,G215)","v":0}]
[null,null,"Scrubbing Brushes/Pads (2 Required)",null,null,null,{"$f":"SUM(G182:G192)","v":0}]
[null,null,"Polypropylene Brush",null,1220192,316.60000000000002,null,{"$f":"G182*F182","v":0}]
[null,null,"Nylon Brush",null,1220193,460.6,null,0]
[null,null,"Super Abrasive Brush",null,1220194,715.3,null,0]
[]
[null,null,"Pad Driver",null,1220201,474.4,null,{"$f":"G186*F186","v":0}]
[null,null,"Pads",null,null,null,{"$f":"SUM(G188:G192)","v":0}]
[null,null,"Brown Stripping - 3M",null,17263,25.5,null,{"$f":"G188*F188","v":0}]
[null,null,"Blue Scrubbing - 3M",null,17262,25.5,null,0]
[null,null,"Red Cleaning - 3M",null,17261,25.5,null,0]
[null,null,"White Polishing - 3M",null,17260,25.5,null,0]
[null,null,"Black Stripping-Hi Pro - 3M",null,370094,28.5,null,0]
[]
[null,null,"Cylindrical Scrubbing Brushes (2 Required)",null,null,null,{"$f":"SUM(G195:G197)","v":0}]
[null,null,"Polypropylene Brush",null,386230,573.29999999999995,null,{"$f":"G195*F195","v":0}]
[null,null,"Nylon Brush",null,386250,728.7,null,0]
[null,null,"Super Abrasive Brush",null,386240,795.2,null,0]
[]
[null,null,"Side Scrubbing Brushes/Pads (1 Required)",null,null,null,{"$f":"SUM(G200:G209)","v":0}]
[null,null,"Polypropylene Brush",null,1220240,233.3,null,{"$f":"G200*F200","v":0}]
[null,null,"Nylon Brush",null,1220230,284.5,null,0]
[null,null,"Super Abrasive Brush",null,1220232,423.5,null,0]
[null,null,null,null,null,null," "]
[null,null,"Pad Driver",null,1220243,308.60000000000002,null,{"$f":"G204*F204","v":0}]
[null,null,"Pads",null,null,null,{"$f":"SUM(G206:G209)","v":0}]
[null,null,"Brown Stripping - 3M",null,89046,15.2,null,{"$f":"G206*F206","v":0}]
[null,null,"Blue Scrubbing - 3M",null,89047,15.2,null,{"$f":"G207*F207","v":0}]
[null,null,"Red Cleaning - 3M",null,89048,15.2,null,{"$f":"G208*F208","v":0}]
[null,null,"White Polishing - 3M",null,89049,15.2,null,0]
[null,null,null,null,null,null,{"$f":"SUM(G211:G212)","v":0}]
[null,null,"Main Sweeping Brushes",null,null,null,{"$f":"SUM(G212:G213)","v":0}]
[null,null,"Sand Wedge Brush - Single Brush  (2 Recommended)",null,1225398,315,null,{"$f":"G212*F212","v":0}]
[null,null,"Sand Wedge Brush - Package of 2 Brushes",null,9017101,455,null,0]
[]
[null,null,"Side Sweeping Brushes (2 Required)",null,null,null,{"$f":"SUM(G216)","v":0}]
[null,null,"Polypropylene Brush",null,87419,134.69999999999999,null,{"$f":"G216*F216","v":0}]
[]
[null,"Maintenance Items",null,null,"Reference Number","Price",{"$f":"SUM(G219:G240)","v":0}]
[null,null,"M17 Service Kit [125 hr]",null,9020270,746.2,null,{"$f":"G219*F219","v":0}]
[null,null,"Squeegee Blade, Linatex®, Side (Order 2)",null,1213211,67.5,null,{"$f":"G220*F220","v":0}]
[null,null,"Squeegee Blade, Urethane, Side (Order 2)",null,1213266,158,null,0]
[null,null,"Squeegee Blade, Gum Rubber, Side (Order 2)",null,1213267,50.300000000000004,null,0]
[null,null,"Squeegee Blade, Linard®, Front",null,1207086,81.900000000000006,null,0]
[null,null,"Squeegee Blade, Linatex®,Rear",null,1207087,114.8,null,0]
[null,null,"Squeegee Blade,Urethane, Front ",null,1208356,229.6,null,0]
[null,null,"Squeegee Blade,Urethane, Rear",null,1208357,301.5,null,0]
[null,null,"Squeegee Blade, Gum Rubber, Front",null,1208358,64.699999999999989,null,0]
[null,null,"Squeegee Blade, Gum Rubber, Rear",null,1208359,86.1,null,0]
[null,null,"Inner Linard® Side Brush Squeegee (19.9\", 507mm)",null,1216319,57.4,null,{"$f":"G229*F229","v":0}]
[null,null,"Inner Urethane Side Brush Squeegee (19.9\", 507mm)",null,1224935,77,null,0]
[null,null,"Inner Gum Rubber Side Brush Squeegee (19.9\", 507mm)",null,1224938,48,null,0]
[null,null,"Outer Linatex® Side Brush Squeegee  (20.4\", 519mm)",null,1216321,66.099999999999994,null,0]
[null,null,"Outer Gum Rubber Side Brush Squeegee (20.4\", 519mm)",null,1224934,68,null,0]
[null,null,"Drain Hose Assembly (Recovery Tank)",null,1206370,54.6,null,0]
[null,null,"Hose Assembly (Rear Squeegee)",null,1207661,57.4,null,{"$f":"G235*F235","v":0}]
[null,null,"Swivel Caster Kit",null,9020233,172.2,null,{"$f":"G236*F236","v":0}]
[null,null,"Squeegee Wheel",null,20833,63.7,null,0]
[null,null,"Main Disk Skirt Kit",null,9020242,71.599999999999994,null,{"$f":"G238*F238","v":0}]
[null,null,"Scrub Fan Kit (Vac Fan Kit)",null,9020256,276.39999999999998,null,0]
[null,null,"Ignition Key",null,361144,10.8,null,0]
[null,null,null,null,null,null,"  "]
[null,"Custom Solution--write in description, qty, price, and PN if applicable",null,null,null,null,{"$f":"SUM(G243)","v":0}]
[null,null,null,null,null,"Insert Prices Here",{"$f":"SUM(G244:G247)","v":0}]
[null,null,null,null,"Custom",null,{"$f":"IF(F244 <> \"\", 1, 0)","v":0},{"$f":"G244*F244","v":0}]
[null,null,null,null,"Custom",null,{"$f":"IF(F245 <> \"\", 1, 0)","v":0},{"$f":"G245*F245","v":0}]
[null,null,null,null,"Custom",null,{"$f":"IF(F246 <> \"\", 1, 0)","v":0},{"$f":"G246*F246","v":0}]
[null,null,null,null,"Custom",null,{"$f":"IF(F247 <> \"\", 1, 0)","v":0},{"$f":"G247*F247","v":0}]
[null,null,"Prepaid and Add",null,"Freight",null,1,{"$f":"G248*F248","v":0}]
[null,null,"Subject to all applicable taxes",null,"Tax",null,1,{"$f":"G249*F249","v":0}]
[]
[null,null,null,null,"MACHINE TOTAL*",null,null,{"$f":"SUM(H49:H249)","v":0},null,null,null,null,"This goes to \"My Documents\""]
[null,null,null,null,null,null,null,{"$f":"SUM(H251)","v":0}]
[]
[null,null,"National Leasing - Leasing Calculation Option:","Finance Option 1",null,"Finance Option 2",null,null,{"$f":"Financing!A38","v":"Rates 2016 - Rev. 7/1/2016"}]
[null,null,"Purchase Option:",1,null,"FMV Scrubber",null,null,{"$f":"Financing!A39","v":"“Blank Payment Amounts Indicate The Financing Option Or Purchase Options Selected Are Not "}]
[null,null,"24 Months",0,null,0,null,null,{"$f":"Financing!A40","v":"Applicable Or The Machine Total Is Below The Minimum Amount For The Selected Vendor”"}]
[null,null,"36 Months",0,null,0,null,null,{"$f":"Financing!A41","v":"\"Quoted monthly payments are estimates only and are based on a certain level of credit rating."}]
[null,null,"48 Months",0,null,0,null,null,{"$f":"Financing!A42","v":"Actual monthly payments may be higher depending on your credit rating.\""}]
[null,null,"60 Months",0,null,0,null,null,{"$f":"Financing!A43","v":"“Financing rates do not include Pre-Paid Service”"}]
[null,"   TennantTrue",null,null,0,0]
[]
[null,null,"Is customer interested in service program?","Yes","*State/County selection required for TennantTrue service options"]
[]
[null,null,"If not, why?"]
[]
[null,null,"Term:",36,null,"AB Brushes","No"]
[null,null,"Monthly machine usage (hrs):",25]
[]
[null,null,"TennantTrue: ","Rate Per Unit",null,"Hourly Labor Rate",null,"Site Visit Charge"]
[null,null,"Gold - Monthly",155]
[null,null,"Gold - Pre Pay Full Term",5189]
[null,null,"Silver - Monthly",117]
[null,null,"Silver - Annually",1371]
[null,null,"Silver - Pre Pay Full Term",4027]
[null,null,"Silver - Per Visit",555]
[null,null,"Pay As You Go",null,null,null,null,null,null,null,"*State/County selection required for 'Pay As You Go' and 'On Demand'."]
[null,null,"On Demand"]
[]
[]
[]
[null,null,"Quote Special Instructions:"]
[]
[]
[null,null,{"$f":"Start_Here!E33","v":"Terms and Conditions"}]
[null,null,{"$f":"Start_Here!E34","v":"Ask your local sales rep for estimated lead times. Verify when placing order"}]
[null,null,{"$f":"Start_Here!E35","v":"All orders subject to acceptance by Tennant Sales and Service Company, Minneapolis, Minnesota"}]
[null,null,{"$f":"Start_Here!E36","v":"Prices subject to change without notice. Subject to any applicable taxes."}]
[null,null,{"$f":"Start_Here!E37","v":"Terms:  Net 30 days.  Payable in Canadian Funds"}]
[null,null,{"$f":"Start_Here!E38","v":"Freight:  Accessories, parts, supplies, detergents, and floor coatings orders delivered DDP "}]
[null,null,{"$f":"Start_Here!E39","v":"shipping point Frt PPD.  Machine orders delivered DDP shipping point Frt PPD and add."}]
[null,null,{"$f":"Start_Here!E40","v":"Returned Merchandise is subject to a restocking fee."}]
[null,null,{"$f":"Start_Here!E42","v":"Printed General Terms and Conditions are also available upon request."}]
[null,null,{"$f":"Start_Here!E43","v":0}]
[]
[null,null,null,null,"Quote Date :",null,null,{"$f":"Letter!$A$25","v":"2014-10-02"}]
["Order Placement Information:  To place your order, fill in PO# and customer signatures,"]
["call or fax to the numbers listed below. Customer Purchase Order is required."]
["If information is missing, orders will be entered and held until all information is received."]
[null,null,"Customer Number",null,{"$f":"Start_Here!F15","v":"Cust Grp 3"}]
[null,null,{"$f":"Start_Here!$F$5","v":0},null,{"$f":"Start_Here!F16","v":0}]
[null,null,{"$f":"Start_Here!$B$18","v":"Sold To Information (Please Verify)"}]
["Company",null,{"$f":"Start_Here!$C$19","v":""}]
["Address",null,{"$f":"Start_Here!$C$20","v":""}]
[null,null,{"$f":"Start_Here!$C$21","v":""}]
["Name",null,{"$f":"Start_Here!$C$22","v":""}]
["Phone",null,{"$f":"Start_Here!$C$23","v":""}]
[null,null,{"$f":"Start_Here!$B$11","v":"Ship To Information (Please Verify)"}]
["Company",null,{"$f":"Start_Here!$C$12","v":""}]
["Address",null,{"$f":"Start_Here!$C$13","v":""}]
[null,null,{"$f":"Start_Here!$C$14","v":""}]
["Name",null,{"$f":"Start_Here!$C$15","v":""}]
["Phone",null,{"$f":"Start_Here!$C$16","v":""}]
[null,null,{"$f":"Start_Here!$B$25","v":"Shipping/Carrier Instructions:"},null,"Order Special Instructions:"]
[null,null,{"$f":"Start_Here!$C$26","v":0}]
[]
[null,null," Customer Purchase Order No. "]
[null,null," (please attach copy) "]
[]
[]
[null,null," Tax Exempt ",null," Yes "]
[null,null,null,null," No "]
[null,null," If Yes, attach a copy of your exemption certificate. "]
[]
[null,null," Requested Delivery Date "]
[null,null,{"$f":"Start_Here!$F$14","v":0}]
[]
[null,null,{"$f":"Start_Here!$F$8","v":0},null,{"$f":"Start_Here!$F$11","v":0}]
[null,null," Authorized Buyer (please print) ",null," Phone Number "]
[]
[]
[null,null," Authorized Buyer Signature "]
[]
[]
[null,null,"Tennant Representative"]
[]
["Specialized Maintenance Equipment"]
[{"$f":"Start_Here!$C$45","v":"TENNANT · 701 NORTH LILAC DRIVE · P.O. BOX 1452 · MINNEAPOLIS, MN 55440-1452 ·"}]
[{"$f":"Start_Here!$C$46","v":" PHONE:800-553-8033 · FAX:763-513-2116"}]
[]
[null,"SPECIAL INFORMATION"]
[]
[null,1,"Standard debris tray on cylindrical unit has a hole in the bottom for water drainage. "]
[]
[null,2,"Pro-Panel Includes: Pro-ID Operator Login, Pro-Check Pre-Operation Checklists, PerformanceView, Rear View Camera"]
[null,null,"and Clogged Filter Indicator.  28 Languages."]
[]
[null,3,"ES® Extended Scrub system is available factory installed only.  This option includes Autofill feature "]
[null,null,"and Detergent Metering system"]
[]
[null,4,"MODEL M17  - USE ONE 36 VOLT BATTERY"]
[null,null,"Unit has one battery compartment that is available in three sizes: 510AH, 750AH and 930AH and two"]
[null,null,"configurations (Standard and Slide Out).  Size below is entire battery compartment."]
[null,null,"The battery format is an Upright Forklift Battery and the overall compartment dimensions are:"]
[null,null,"Length:",null,"38.1 inch / 970 mm"]
[null,null,"Width:",null,"16.3 inch / 415 mm"]
[null,null,"Height:",null,"32.6 inch / 830 mm"]
[null,null,"Height (WITH slide out system):",null,"31.3 inch / 795 mm"]
[null,null,"Maximum Weight:",null,"2,300 lbs/1,045kg"]
[]
[null,5,"Model M17 Continuous Runtime Chart. (up to)"]
[]
[]
[]
[]
[]
[]
[]
[]
[]
[]
[]
[null,null,"The runtimes are guidelines.  Actual times will vary based on floor conditions, final machine configuration & usage."]
[]
[null,6,"To calculate weights with batteries add the following to the product “Net” or “Ship” weights:"]
[null,null,"500 AH Battery = +1458 lbs / 663 kg"]
[null,null,"750 AH Battery = +2124 lbs / 965 kg"]
[null,null,"930 AH Battery = +2178 lbs / 990 kg"]
[]
[null,7,"Expected Cycle Life:  Cycle life is the number of charge cycles a battery is expected to last."]
[null,null,"Type of Battery = Number of Cycles"]
[null,null,"510 AH Battery = 1200+ Cycles",null,"Flat Plate Construction"]
[null,null,"750 AH Battery = 1200+ Cycles",null,"Flat Plate Construction"]
[null,null,"930 AH Battery = 1500+ Cycles",null,"Tubular Construction"]
[]
[null,8,"Each battery is available with and without a battery watering system.  "]
[null,null,"Watering System is manufactured on the battery and cannot be added in the field."]
[]
[null,9,"Slide-out battery kit does not include battery extraction device."]
[]
[null,10,"For battery extraction, the height of the battery compartment is 20 inch / 510 mm off the floor"]
[]
[null,11,"Model M17 Charge Time Estimates*","510AH","750AH","930AH"]
[null,null,"80A Output Charger","8 Hours","Not Recommended***","Not Recommended***"]
[null,null,"100A Output Charger","Not Advised**","9 Hours","10.4 Hours"]
[null,null,"120A Output Charger","Not Advised**","8 Hours","9.5 Hours"]
[null,null,"240A Output Charger (Opportunity Charger)","Not Advised**","Not Advised**","4.0 Hours"]
[]
[null,null,"The 7300 did have a 150AH charger, but it's output was actually equivalent to the 120A charger due to charger"]
[null,null,"efficiencies with the new charger technology"]
[null,null,"* These charge times are based on the High Frequency Charger Outputs, match to closest 7300 charger for est."]
[null,null,"** It is not advised because the charger output would overheat the battery causing premature failure."]
[null,null,"*** This Charger not recommended for the 750AH and 930AH requires reprogramming the algorithm to work properly with the battery.  "]
[]
[null,12,"Opportunity Charging for the M17 Offering:"]
[null,null,"Wet Tubular 930AH C/6 battery is available for the Opportunity Charging system and can only be ordered "]
[null,null,"with the 240A 480V AC 50/60Hz 3Ph Charger 1219396"]
[null,null,"Opportunity Charger is only available with Wet 930AH Battery, 9017261"]
[null,null,"Wet Tubular 930AH Battery for Opportunity Charging is standard with battery watering"]
[]
[null,13,"The chargers for the M17 may require a local electrician to wire them into the customers electrical system. "]
[null,null,"Only the single phase charger comes with a cord, but the customer's outlet will determine the plug needs"]
[]
[null,14,"Sales Rep Charger Kit 223683 is available for more convenient battery charging.  The 120 volt \"Smart\"charger"]
[null,null,"is recommended for occasional use only.  An adaptor is available to connect the Anderson 175 on to the charger"]
[null,null,"to the Anderson 350 connectors on the battery 363480 (order this adapter as a Custom Solution).  "]
[]
[null,15,"Productivity Package includes the standard Vacuum Wand, the Scrubbing Side Brush and the Spray Nozzle & Hose."]
[]
[null,16,"This Auto-Fill is Available only with Conventional and ec-H2O machines (fills Soluton Tank).  It is included "]
[null,null,"in the ES equipped machines (fills Solution Tank-100% and Recovery Tank-50%)."]
[]
[null,17,"Includes a single drain hose that attaches to the drain valve…provides 10 ft / 3 m reach."]
[]
[null,18,"AV BU Alarm w/ Strobe will be mounted on the tank.  Cannot be ordered with the Strobe Light on Overhead Guard."]
[]
[null,19,"A French and English manual will be supplied for all units shipping into Quebec, Canada at no charge.  An additional manual"]
[null,null,"can be ordered (for a total of 3 manuals) for an additional charge as stated under 'Additional Operator Manual'."]
[]
[null,20,"Pre-Paid and Monthly Packages are available for the IRIS Information Service. IRIS Module is required and NOT included in the price of the IRIS Information Service:"]
[null,null,"3 Year Pre-Paid IRIS Information Service                 $350.00"]
[null,null,"5 Year Pre-Paid IRIS Information Service                 $560.00"]
[null,null,"A monthly contract can be set up at $14 per month w/ 12 month minimum commitment."]
[null,null,"IRIS Telemetry Module only covers the price of the hardware. IRIS Telemetry requires an IRIS Telemetry Module and an IRIS Information Service Package."]
[]
[null,21,"CUSTOM PAINT: Customized painting is limited to metal parts only. "]
[null,null,"All non-metal components must remain standard TENNANT colors."]
[null,null,"When selling a Custom Color, you will need to confirm that the color falls within the standard colors "]
[null,null,"available from our powder supplier (50 plus colors to choose from).  Please request a color chart from "]
[null,null,"our Custom Engineering Group (Abby Liubakka (X1302) or Dan Feyma (X1772))and obtain the customer's approval.  "]
[null,null,"The order can not be processed without their approval.  If the color is outside this range, it can still be obtained but "]
[null,null,"it will be at an additional charge and will increase the lead time.  For pricing and lead time impact information "]
[null,null,"contact our Custom Engineering Group."]
[null,null,"  When choosing the special paint the following information is needed and must be added to the"]
[null,null,"  Quote Special Instructions section.  Failure to do so will create a two-week delay in your order."]
[null,null," a.  Which parts do you want painted, White parts, green parts, black parts?"]
[null,null,"(unless otherwise agreed upon with Custom Solutions Dept., all metal parts will be painted with custom color)"]
[null,null," b.  Color requested. "]
[]
[null,22,"Shipping Weights and Dimensions",null,"Skid"]
[null,null,"Weight (w/ Wet 750AH Battery)",null,"5700 lbs / 2590 Kg"]
[null,null,"Length",null,"118\" / 3000 mm"]
[null,null,"Width",null,"79\" / 1975 mm"]
[null,null,"Height",null,"68\" / 1727 mm"]

{"sheet":"Pricezones","index":16,"n_rows":62,"n_cols":13,"rows_kept":62,"cut":false,"hidden":true,"merged":[]}
["Sheetname","Green discount","Yellow","Red"," ","Product subcategories","PH2",null,"Discounts Dropdown",null,null,"Canada","2016-01-11"]
[null,"Level A","Level B","Level C","Level D",null,null,null,"Select a Trade-in","Select Tennant Program"]
["Specialty",0,0.35000000000000003,0.5,null,"scrubber","341074",null,"Trade-in Scrap","Strategic Accts"]
["T2",0,0.2,0.4,null,"scrubber","306300",null,"Recon Trade-in","Strategic Alliance"]
[5700,0,0.2,0.4,null,"scrubber","306501",null,null,"Recon Sale"]
[5680,0,0.2,0.4,null,"scrubber","306500",null,null,"Recon Trade-in"]
["T1_T1B",0,0.2,0.4,null,"scrubber","306200",null,null,"Industrial Bundling"]
["T3_plus_Orbital",0,0.2,0.4,null,"scrubber","306301",null,null,"Demonstrator units, greater than 3 months, full warranty"]
["T300",0,0.2,0.4,null,"scrubber",null,null,null,"Distributor - Commercial or Industrial"]
["T300e",0,0.2,0.4,null,"scrubber",null,null,null,"Contracts (example GSA, Local Gov)"]
["T5",0,0.2,0.4,null,"scrubber","306400"]
["T5e",0,0.2,0.4,null,"scrubber","306400"]
["T7",0,0.2,0.4,null,"scrubber","307500"]
["T12",0,0.2,0.4,null,"scrubber","307600"]
["T16",0,0.11,0.35000000000000003,null,"scrubber","308007"]
["T17",0,0.11,0.35000000000000003,null,"scrubber","308400"]
[8300,0,0.11,0.35000000000000003,null,"scrubber","311102"]
["M17",0,0.11,0.35000000000000003,null,"scrubber","311102"]
["T20",0,0.11,0.35000000000000003,null,"scrubber","308205"]
["M20",0,0.11,0.35000000000000003,null,"scrubber","311302"]
["M30",0,0.11,0.35000000000000003,null,"scrubber","311402"]
["Dual_Tech_ReadySpace_R14",0,0.35000000000000003,0.5,null,"Sweeper","327005"]
["Dual_Tech_ReadySpace_1610",0,0.35000000000000003,0.5,null,"Sweeper","327003"]
["MR3_E5",0,0.35000000000000003,0.5,null,"Sweeper","327002"]
["Carpet_Extractors",0,0.35000000000000003,0.5,null,"Sweeper","327003"]
["Vacuums",0,0.35000000000000003,0.5,null,"Sweeper","323121"]
["F_Series_Floor_Machine",0,0.35000000000000003,0.5,null,"Sweeper","336233"]
["Burnishers",0,0.35000000000000003,0.5,null,"Sweeper","333010"]
["B5",0,0.35000000000000003,0.5,null,"Sweeper","333010"]
["B7",0,0.35000000000000003,0.5,null,"Sweeper","333011"]
["B10",0,0.35,0.5,null,"Sweeper"]
["S9",0,0.16,0.3,null,"Sweeper","302506"]
["S5_S3",0,0.16,0.3,null,"Sweeper","302500"]
[3640,0,0.16,0.3,null,"Sweeper","302406"]
["S10",0,0.16,0.3,null,"Sweeper","302601"]
[6100,0,0.16,0.3,null,"Sweeper","303050"]
[6200,0,0.11,0.35000000000000003,null,"Sweeper","304004"]
["S20LC",0,0.11,0.35000000000000003,null,"Sweeper","304053"]
["S20EV",0,0.11,0.35000000000000003,null,"Sweeper","304053"]
["S30",0,0.11,0.35000000000000003,null,"Sweeper","304215"]
[800,0,0.11,0.35000000000000003,null,"Sweeper","304309"]
["Sentinel",0,0.11,0.35000000000000003,null,"Sweeper","304403"]
[4300,0,0.11,0.35000000000000003,null,"Sweeper","312013"]
["GM_400",0,0.11,0.35000000000000003,null,"Sweeper","312101"]
["GM_636",0,0.11,0.35000000000000003,null,"Sweeper","312104"]
["DualTech_ReadySpace_StriveRider",0,0.35000000000000003,0.5,null,"Nobles","327006"]
["DualTech_ReadySpace_Strive",0,0.35000000000000003,0.5,null,"Nobles","327004"]
["Cord_Electric",0,0.35000000000000003,0.5,null,"Nobles","327007"]
["Carpet_Extractors",0,0.35000000000000003,0.5,null,"Nobles","327003"]
["Specialty",0,0.35000000000000003,0.5,null,"Nobles","341074"]
["Vacuums",0,0.35000000000000003,0.5,null,"Nobles","323121"]
["Floor_Machine",0,0.35000000000000003,0.5,null,"Nobles","336233"]
["Burnishers",0,0.35000000000000003,0.5,null,"Nobles","333010"]
["SpeedGleam5",0,0.35000000000000003,0.5,null,"Nobles","333012"]
["SpeedGleam7",0,0.35,0.5,null,"Nobles"]
["SpeedGleam_Rider",0,0.35,0.5,null,"Nobles"]
["Sweepers",0,0.2,0.3,null,"Nobles","302505"]
["SS5_24_32",0,0.25,0.4,null,"Nobles","306401"]
["SS3_XC_Orbital",0,0.25,0.4,null,"Nobles","306302"]
["SS300",0,0.25,0.4,null,"Nobles"]
["SS_15",0,0.25,0.4,null,"Nobles","306201"]
["SSR",0,0.25,0.4,null,"Nobles"]

{"sheet":"PricezonesUsers","index":17,"n_rows":183,"n_cols":7,"rows_kept":183,"cut":false,"hidden":true,"merged":[]}
["Green","Yellow","Red",null,"Level A name","Level B name","Level C name"]
["plo","bhn2","dce4",null,"Pao LeePalao","Brian Hoffman","David Chase"]
["jnm","dcr4","evl2",null,"Joni Marti","Dave Cormier","Erik Vichill"]
["djm","dlr4","p1g",null,"Donna Martin","Dave Lancaster","Paul Gee"]
["aws5","jbn13","rsh2",null,"Aaron Williams","Jeff Brown","Rory Saleh"]
["amh2","kje","tjw",null,"Adam McCullough","Kevin Josche","Terry Watson"]
["ars4","dek","jld",null,"Adam Russ","Dennis Kortsha","John Lund"]
["asr12","gbl",null,null,"Adam Schaffer","Greg Lano"]
["amr4","jhv",null,null,"Aimee Muller","Jim Voss"]
["abi","kse",null,null,"Alan Bartolini","Kreg Eckert"]
["a1w","bpc",null,null,"Albert Watson","Brian Clifton"]
["abe3","cgn4",null,null,"Alex Barreneche","Christopher Ganassin"]
["aps5","gmt",null,null,"Alfred Pappas","Glenn McNutt"]
["adr3","m3c",null,null,"Alicia Decker","Michael Cary"]
["acn10","rwn5",null,null,"Allan Cockburn","Ray Wan"]
["asr15","rhr2",null,null,"Amber Spanier","Rich Hunsinger"]
["agn","jce7",null,null,"Andrew Gamson","Jason Curotte"]
["ayg2","bcd",null,null,"Andrew Young","Brant Chatfield"]
["asp","rbh",null,null,"Andy Stump","Raminder Badh"]
["api","spe5",null,null,"Anthony Piscitelli","Scott Purdie"]
["a4s","dcs",null,null,"Armando Silva","David Shearer"]
["blk","jfk",null,null,"Barry Killian","Jeff Fogleboch"]
["bbm","jdl",null,null,"Ben Barham","Jim Laubach"]
["bcn6","nck",null,null,"Ben Carlson","Neville Cork"]
["bcn","sft2",null,null,"Ben Cronin","Steve Forrest"]
["bwn4","ete",null,null,"Bert Wilson","Erich Terwege"]
["bhn5","ghy2",null,null,"Betty Hartman","Gray Huey"]
["bsn9","jhn8",null,null,"Betty Sundeen","Jeff Halliburton"]
["ban7","jtt2",null,null,"Bill Allen","John Tackett"]
["weh","djm",null,null,"Bill Hatten","Donna Martin"]
["bhn4","khl2",null,null,"Bill Henderson","Katie Hempel"]
["bmr3",null,null,null,"Bill Moeller"]
["bgs",null,null,null,"Blake Gross"]
["rgh",null,null,null,"Bob Hoffman"]
["brl2",null,null,null,"Bob Ramsdell"]
["bht2",null,null,null,"Brad Heckert"]
["boa",null,null,null,"Brandi O'Harra"]
["ben4",null,null,null,"Brandon Erlandson"]
["bly4",null,null,null,"Bret Lovelady"]
["bjn6",null,null,null,"Brett Jordan"]
["bha",null,null,null,"Brian Anderton"]
["b2b",null,null,null,"Brian Bambrick"]
["a1g",null,null,null,"Alain Giguere"]
["cbc",null,null,null,"Chris Chatterson"]
["jpl",null,null,null,"John Powell"]
["m4c",null,null,null,"Marc Chamberland"]
["m1m",null,null,null,"Michel Mendes"]
["mrl2",null,null,null,"Murray Russell"]
["pck4",null,null,null,"Paul Clark"]
["sax",null,null,null,"Samuel Alix"]
["csh4",null,null,null,"Chad Smith"]
["cwe",null,null,null,"Clayton Wolfe"]
["ggr3",null,null,null,"Gary Gainer"]
["mhn4",null,null,null,"Mark Hinton"]
["wss",null,null,null,"William Sessions"]
["d6s",null,null,null,"Dan Sachse"]
["mep",null,null,null,"Mike Poindexter"]
["ndr",null,null,null,"Neal Ruhter"]
["pkt",null,null,null,"Pete Thomson"]
["rtr4",null,null,null,"Richard Tucker"]
["sbe6",null,null,null,"Sam Beloate"]
["dph",null,null,null,"Dan Harrington"]
["dsm",null,null,null,"David Marcus"]
["ghh",null,null,null,"Gordon Harris"]
["kly",null,null,null,"Kevin Lay"]
["lrz4",null,null,null,"Luis Rodriguez"]
["mpe2",null,null,null,"Mark Pryce"]
["msr13",null,null,null,"Mike Schunder"]
["pbn7",null,null,null,"Patrick Bannon"]
["rsn3",null,null,null,"Rem Sackmann"]
["rty2",null,null,null,"Rob Tracey"]
["rnr5",null,null,null,"Rory Nunamacher"]
["sbl2",null,null,null,"Shane Bechtel"]
["skh",null,null,null,"Steve Koch"]
["tsk2",null,null,null,"Timothy Stefaniak"]
["tcd3",null,null,null,"Tom Castenschiold"]
["bwd",null,null,null,"Bruce Wild"]
["cck4",null,null,null,"Chad Clark"]
["cke4",null,null,null,"Christopher Kane"]
["dsh9",null,null,null,"Dave Smith"]
["elr",null,null,null,"Elden Read"]
["htn",null,null,null,"Henry Thompson"]
["jbs2",null,null,null,"Jason Bowers"]
["jhr10",null,null,null,"Joel Hoover"]
["jtn14",null,null,null,"Jonathan Tuwaidan"]
["jrz3",null,null,null,"Jose Rodriguez"]
["rle6",null,null,null,"Ray Lake"]
["srs5",null,null,null,"Scott Rodgers"]
["vbi",null,null,null,"Venus Bakhtiari"]
["cwf",null,null,null,"Chad Frieburg"]
["jhn16",null,null,null,"Jeremy Hanson"]
["kea",null,null,null,"Kim Wessinger"]
["tdr",null,null,null,"Tim Daumueller"]
["ccn6",null,null,null,"Chad Clingman"]
["dcl3",null,null,null,"Daniel Crull"]
["dlm2",null,null,null,"Daniel Lanham"]
["ewt2",null,null,null,"Edwin Willett"]
["jby8",null,null,null,"Jeff Berry"]
["mco5",null,null,null,"Maria Cayado"]
["rml2",null,null,null,"Rachel Maxwell"]
["rcn2",null,null,null,"Rick Cobian"]
["rme2",null,null,null,"Rob McCarville"]
["swe",null,null,null,"Seth Wylie"]
["d1b",null,null,null,"Dave Bonacquisti"]
["gan2",null,null,null,"Greg Anderson"]
["jaa2",null,null,null,"Jay Atienza"]
["jks4",null,null,null,"Justin Korus"]
["k5s",null,null,null,"Keith Sheffer"]
["kcn4",null,null,null,"Kevin Clifton"]
["lhl2",null,null,null,"Lorenzo Hubbell"]
["mln6",null,null,null,"Mark Limon"]
["mhn14",null,null,null,"Matt Hoffman"]
["nsg2",null,null,null,"Nick Schmalenberg"]
["plb",null,null,null,"Paul Bitsos"]
["rak",null,null,null,"Rick Kazmer"]
["twy",null,null,null,"Tim Wiley"]
["tcy3",null,null,null,"Tom Cassidy"]
["tcx",null,null,null,"Tom Cox"]
["abe",null,null,null,"Tony Bowie"]
["zpn",null,null,null,"Zach Patchen"]
["dde2",null,null,null,"Dennis Doyle"]
["hde",null,null,null,"Hugo Daigle"]
["cgm3",null,null,null,"Caroline Graham"]
["cbr9",null,null,null,"Christina Butcher"]
["dsg",null,null,null,"Dan Spaulding"]
["dbs7",null,null,null,"David Burrows"]
["jwn9",null,null,null,"Eddie Whitman"]
["gpl",null,null,null,"Glenn Poskocil"]
["gaa2",null,null,null,"Greg Andia"]
["gmr4",null,null,null,"Greg Maslar"]
["jpl3",null,null,null,"Jacob Powell"]
["jtn2",null,null,null,"Jay Templeton"]
["jml4",null,null,null,"Jonathan Mitchell"]
["kah",null,null,null,"Kimberly Henry"]
["kms2",null,null,null,"Kyle Mills"]
["mkr",null,null,null,"Matthew Kitzmiller"]
["mcn4",null,null,null,"Mitch Coleman"]
["rlr4",null,null,null,"Ray Lohner"]
["twc",null,null,null,"Thomas Chaloux"]
["tgv",null,null,null,"Thomas Vanek"]
["tcb2",null,null,null,"Toby Clubb"]
["wby2",null,null,null,"William Braddy"]
["wbj",null,null,null,"Bruce Jones"]
["cbn19",null,null,null,"Chris Brasington"]
["dns6",null,null,null,"Daniel Nichols"]
["ffs2",null,null,null,"Frank Fowlkes"]
["grr2",null,null,null,"Gregg Richter"]
["gmr3",null,null,null,"Gus Miller"]
["jhk5",null,null,null,"James Hamrick"]
["j3g",null,null,null,"Jeff Grove"]
["jpr4",null,null,null,"Josh Parker"]
["lgs3",null,null,null,"Lane Garris"]
["leh",null,null,null,"Larry Huelat"]
["lpv",null,null,null,"Larry Van Damme"]
["mrs6",null,null,null,"Mark Reyers"]
["mky",null,null,null,"Matt Kelley"]
["mhr2",null,null,null,"Maury Hayter"]
["ngk",null,null,null,"Neil Krull"]
["pld2",null,null,null,"Patrick Leonard"]
["pbl",null,null,null,"Paul Lehman"]
["rbn2",null,null,null,"Robert Bean"]
["rlg",null,null,null,"Robert Lang"]
["rln",null,null,null,"Ron Nagle"]
["rgn",null,null,null,"Ron Ness"]
["twt2",null,null,null,"Troy West"]
["kjn10",null,null,null,"Kevin Jeanson"]
["nma4",null,null,null,"Neeraj Marwaha"]
["psn3",null,null,null,"Peter Slickman"]
["rmy5",null,null,null,"Rob Murray"]
["cmy8",null,null,null,"Catherine Mulvanerty"]
["ccn",null,null,null,"Chad Cramton"]
["han",null,null,null,"Hauns Anderson"]
["jby12",null,null,null,"Jacob Bruley"]
["jws8",null,null,null,"Jay Williams"]
["j7w",null,null,null,"Joseph Wilkerson"]
["kve2",null,null,null,"Kyle Valentine"]
["mve3",null,null,null,"Mark Viale"]
["mwy",null,null,null,"Martin Whittlesey"]
["rld2",null,null,null,"Richard Lockwood"]
["sdl4",null,null,null,"Sean Dovel"]
["dbr",null,null,null,"David Basener"]
["dan",null,null,null,"Donald Nelson"]
["klc",null,null,null,"Kevin Cull"]

{"sheet":"Contact","index":18,"n_rows":49,"n_cols":6,"rows_kept":49,"cut":false,"hidden":false,"merged":[[8,4,9,4],[42,0,42,5],[44,0,44,5]]}
[" GE Capital Solutions"]
["Equipment Finance",null,null,"Client Services:  (800) 535-1480"]
["300 E. John Carpenter Freeway, Irving, TX 75062",null,null,"Sales & Operations:  (800) 233-5103"]
["Name","Location","Function","Phone Number","Fax Number","E-Mail Address"]
["Bryan Irvine","Dallas, TX","Program Manager","(469) 242-7898 (office)",null,"bryan.irvine@ge.com"]
["Michael Baldock","Dallas, TX","Relationship Manager- MID SOUTH, SOUTH EAST\n","(469) 586-2010 (office)\n(817) 233-1812 (cell)","(800) 878-7975","Michael.baldock@ge.com"]
["Vince Monteleone","Dallas, TX","Relationship Manager- NORTH CENTRAL, NORTH EAST, WEST","(972) 819-2693 (office)","(877) 430-5832","vince.monteleone@ge.com"]
["Chris Rappleye","Dallas, TX","Relationship Manager-  Strategic Accounts","(972) 819-2690 (office)\n(817) 975-0015 (cell)","(972) 692-7959","Chris.Rappleye@ge.com"]
["Customer Support Center -\nJoe Sims","Cedar Rapids, IA","Existing leases – Questions re: billing, payoffs, taxes, insurance, returns, etc.","(319) 841-7325","Please help save time & have the Account Schedule Number (Lease Number) when calling.","joseph.sims@ge.com"]
["Asset Management - \nJohn Rasmussen","Danbury, CT","Expiring leases - Questions re: Buyout to Return invoices, Payoff invoices, etc.","(203) 749-2120",null,"john.rasmussen@ge.com"]
["Canada",null,null,"Main Phone:  (800) 461-9039"]
["2300 Meadowvale Boulevard, Suite 200; Mississauga, ON  L5N 5P9"]
["Name","Location","Function","Phone Number","Fax Number","E-Mail Address"]
["Patrick Pearson","Burlington, ON","Vice President, Vendor Finance","(905) 858-4977","(905) 248-3468","patrick.pearson@ge.com"]
["Neesha Celetti","Toronto, ON","Account Manager","(905) 858-6685","(877) 898-3134","neesha.celetti@ge.com "]
["Kyle Turpin","Toronto, ON","Assistant Account Manager","(905) 858-5687","(877) 898-3134","kyle.turpin@ge.com"]
["* All inquires for existing leases (i.e. buy out quotes, billing questions, etc.) should be directed to the Customer Support Center."]
[]
["U.S. Bank"]
["U.S.A.",null,null,"Main Phone:  (800) 934-7444"]
["1310 Madrid Street, Ste. 101, Marshall, MN 56258",null,null,"Fax to Credit:  (800) 328-9092"]
["Name","Location","Function","Phone Number","Fax Number","E-Mail Address"]
["Jeff Bump","Marshall, MN","Supports Mid South, North Central, and Southeast","(507) 532-8434","(866) 977-0939","jeff.bump@usbank.com"]
["Erik Wells","Marshall, MN","Supports North East, West, Strategic Accounts","(507) 532-8435","(866) 977-0948","erik.wells@usbank.com"]
["Sue Shuckhart","Marshall, MN","FMV end of lease buyout, off lease equipment","(800) 328-5371 x1533311 ","(800) 328-9092 ","suzanne.shuckhart@usbank.com"]
["Melissa Richardson","Marshall, MN","Existing leases - All questions: billing, payoffs, taxes, insurance, returns, etc.","(800) 828-8246 Ext 1533412","(800) 328-9092 ","melissa.richardson@usbank.com"]
[]
["All-Lines Leasing"]
["U.S.A.",null,null,"Main Phone:  (800) 477-5855 or (952) 516-7360"]
["100 Prairie Center Drive, Eden Prairie, MN 55344",null,null,"Fax to Credit:  (800) 288-4959 or (952) 516-7321"]
["Name","Location","Function","Phone Number","Fax Number","E-Mail Address"]
["Duncan Leighton","Eden Prairie, MN","Relationship Manager","(888) 705-1021","(800) 288-4959\n(952) 516-7321","duncan@all-linesleasing.com"]
["Tony Hunt","Eden Prairie, MN","Sales Manager - Supporting AK, AZ, CA, CO, CT, HI, ID, KS, MA, ME, MT, NH, NJ, NM, NV, NY, OK, OR, PA, RI, TX, UT, VT, WA, WY","(888) 705-0498","(800) 288-4959\n(952) 516-7321","tony@all-linesleasing.com"]
["Tony Hunt","Eden Prairie, MN","Sales Manager - Supporting AL, AR, DE, FL, GA, IA, IL, IN, KY, LA, MD, MI, MN, MO, MS, NC, ND, NE, OH, SC, SD, TN, VA, WI, WV","(888) 705-0498","(800) 288-4959\n(952) 516-7321","tony@all-linesleasing.com"]
[]
["National Leasing"]
["Canada",null,null,"Main Phone:  (866) 208 4540"]
["1525 Buffalo Place,Winnipeg, Manitoba, R3T 1L9",null,null,"Fax to Credit:  (877) 871-2199"]
["Name","Location","Function","Phone Number","Fax Number","E-Mail Address"]
["John Tersigni","Markham, Ontario","District Manager","(866) 208-4540","(877) 871-2199","john.tersigni@nationalleasing.com"]
["Karen Mckerracher","Winnipeg","Sales Coordinator","(877) 599-4966","(877) 871-2199","karen.mckerracher@nationalleasing.com"]
[]
["Tennant"]
["U.S.A.",null,null,"Main Phone:  (763) 540-1200"]
["P. O. Box 1452\nMinneapolis, MN 55440-1452"]
["Name","Location","Function","Phone Number","Fax Number","E-Mail Address"]
["Angie Hennessy","Minneapolis (Plant 1)","Sr. Product Manager, Service","(763) 513-1819","(763) 513-2112","angie.hennessy@tennantco.com"]
["Chris Lund","Minneapolis (Plant 1)","Product Manager, Service","(763) 513-1879","(763) 513-2112","chris.lund@tennantco.com"]
["Jodie Cooke","Minneapolis (Plant 1)","End of Lease Administrator (inspections, returns, etc.)","(763) 540-2507","(763) 513-1725","jodie.cooke@tennantco.com"]

{"sheet":"Help","index":19,"n_rows":167,"n_cols":3,"rows_kept":167,"cut":false,"hidden":false,"merged":[]}
[null,"Instructions For The Use Of The Quote/Order Spreadsheet","02/01/16 Prices"]
[null,null,"Can Prices R 7/1/2016"]
[null,"TO CUSTOMIZE your cover letter with your own name and region phone number, do the following:"]
[null,"1.  Change the template (adding your name and region office address/phone number to the Start Here Tab (Seller Info)"]
[null,"2.  Click on FILE , click on SAVE AS"]
[null,"3.  In the \"Save as type\" box, select Template from the drop down list"]
[null,"4.  In the \"File Name\" box, enter the name you want to use for this file"]
[null,"5.  File name should be QT16ScrubberCD.xltm"]
[null,"6.  Click Save"]
[]
[null,"When SAVING the template after working on it, always make sure it is save as: "]
[null,"** Excel Macro-Enabled Workbook (*.xlsm)"]
[null,"This ensure that all macros remain and the template functions properly."]
[null,"Example:"]
[]
[]
[]
[]
[]
[]
[]
[]
[]
[]
[]
[null,"TennantTrue:"]
[null,"1. On ‘Start Here’ Sheet"]
[null,"a. Select both State and County information from drop down"]
[null,"b. If customer is a National Account, select ‘Yes’"]
[null,"c. If you choose to discount, enter a percent in the TennantTrue Discount area"]
[null,"2. After completing a machine quote, select ‘Yes’ next to “Is customer interested in service program?” NOTE: if ‘Yes’ is not an option, make sure Step 1 above has been completed."]
[null,"3. Select anticipated Monthly machine usage"]
[null,"4. Click ‘Add to Summary’ to add data to TennantTrue Summary"]
[null,"5. When emailing to a customer:"]
[null,"a. First delete all worksheets you do not want to include.  To do this, while holding down "]
[null,"the SHIFT key, select the worksheets you wish to delete."]
[null,"b. Right Click while still pointing to one of the selected worksheets"]
[null,"c. Select 'Delete'"]
[null,"d. When the message \"Data may exist in the sheet(s) selected for deletion.  To "]
[null,"permanently delete the data, press Delete.\" appears, select 'Delete' "]
[null,"e. Go to File -> Save As -> and save as a separate file"]
[]
[null,"TO USE THE QUOTE/ORDER FORM:"]
[null,"1.  Enter all pertinent information on the Start Here sheet.  This information will be carried over to the Cover Letter and Quotation sheets.  Get as much information as you can regarding ordering information—this will save a lot of time later (and be easier to read if it is typed)."]
[null,"2 If you have access to the Tennant Intranet, you can verify leadtimes from this address:"]
[null,"Machine availablility Minneapolis, MN"]
[null,"Machine availablility Holland, MI"]
[]
[null,"3.  You may edit and customize the letter where/when appropriate."]
[null,"4.  Click on the tab of the machine you want to quote.  Scroll down the list of machine power sources and options and enter the number desired in the Quantity box.  "]
[null,"5.  Use the arrows on the bottom left to scroll to machine family tabs not visible (back and forth)."]
[null,"6.  Use the Specials area for  Freight and Tax. You may also use this space to add Trade-In, Special promotional discounts, Additional product lines being included in the quote.   Fill in the description, price, and quantity. Note: You may enter a negative amount for discounts or trade-in allowances for example"]
[null,"7.  After all items you want to quote have a quantity entered, click on Tools on your menu bar.  Click on \"Hide Blank Qty\".  The list will automatically shorten to only the items you selected to quote.  To see the entire list again, click on Tools again, click on \"Show All Qty\"."]
[]
[null,"QUOTING"]
[null,"1.  To the customer:"]
[null,"**Print or fax quote (see Fax information below)"]
[null,"2.  To Minneapolis for a formal SAP quote. "]
[null,"**Email or fax to your quote coordinator (See Fax or Email information below)"]
[null,"**Sales Support fax for Quotes (763) 513-2116"]
[]
[null,"ORDERING"]
[null,"1.  Fill in the information under Order Placement Information. "]
[null,"      "]
[null,"The following information is required to place the order:"]
[null,"   1  Order info (one of the following is attached):"]
[null,"       - Hard copy purchase order (complete)"]
[null,"       - Sales order form (complete) and signed by customer"]
[null,"   2.  Full company name and billing address (sold-to)"]
[null,"   3.  Complete Ship-to information"]
[null,"   4.  Ship-to contact name and phone number"]
[null,"   5.  Buyer’s name and phone number"]
[null,"   6.  Requested delivery date for the machine"]
[null,"   7  Complete configuration with part numbers (including brushes and detergent)"]
[null,"   8.  Credit Info: "]
[null,"       - New account or location: Completed credit application"]
[null,"       - Existing account: Updated credit info included (or not required per _______ in Credit)"]
[null,"   9.   Tax exemption certificate for ship-to state if customer wants exemption"]
[null,"   10.  SAP quotation number, if applicable, and quote is consistent with PO"]
[]
[null,"2.  Fax the form, PO, tax exemption certificate, etc. to: (763) 513-2116"]
[]
[null,"FAX"]
[null,"1.  Fax by selecting Winfax as your printer.  "]
[null,"2.  Only one excel TAB will fax at a time.  If you have multiple tabs, you must send each tab individually."]
[]
[null,"EMAIL"]
[null,"1. EMail one tab or several tabs.  When you have completed your quote, click on Option, Hide Blank Qty."]
[null,"2.  Select the tab(s) to be deleted (hold the control button down to select multiple tabs)"]
[null,"   - Note: do not select Start_Here page. If you keep this sheet, your links to your company name, contact, etc will be preserved on your quote when the customer or Customer Service gets it. You will be able to change the quote later as well because the hide/show quantities will stay in tact."]
[null,"3.  Click on Edit, click on \"Delete Sheet\", click OK."]
[null,"4.  If you intend to email the quote and do not want the Special Information at the bottom of the machine to be transmitted to your customer, delete the Special Information.  These cells have been left unprotected for this purpose."]
[null,"5.  Click File, Send and address your EMail"]
[]
[null,"FAQ"]
[null,"Q: How to I add price in the Specials area (discounts, freight, tax, etc)?  It wants a password.:"]
[null,"A. Fill in the description, price (under the heading “insert price here”), and quantity.  The extended price will calculate automatically."]
[]
[null,"Q: Who do I call for questions?"]
[null,"A. If you have any questions regarding the use of this template, please contact your local Tennant Rep or Customer Service @ (800) 553-8033 and ask for extension 2180."]
[null,"A. If you have questions regarding pricing, contact Customer Service @ (800) 553-8033 and ask for extension 2177."]
[null,"A. If you have questions regarding quotes or machine orders, contact Customer Service @ (800) 553-8033 to speak with your Quote Coordinator or Machine Specialist."]
[]
[null,"Q: I tried to take an item off the machine and the price column says --  #Value!  -- .  How do I get rid of it?"]
[null,"A: Move your cursor to the quantity column and press the delete key on your keyboard.  To avoid it in the future, do not use the space bar in the quantity column."]
[]
[null,"Finance Quote Templates Cheat Sheet"]
[]
[null,"1. Payments are calculated based on Machines Total, Purchase Options, and Terms. Any changes made to these will be calculated automatically."]
[null,"2. The Machine Total must be a minimum of $2000 for All-Lines Leasing and $5000 for GE and US bank or the payment amount will be blank."]
[null,"3. To change \"Purchase Options\" or \"Terms\", simply click on the cell. The drop down arrow will show up on the right. Click on the drop down arrow to select a value."]
[null,"4. \"Rent To Own\" is only available for 9, 12, or 18 months. Those terms AND \"Rent To Own\" option MUST be selected together to show payment, otherwise, the cell will be blank."]
[null,"5. To change vendor (All-Lines Leasing, GE, or US Bank), go to the \"Start_Here\" tab, and scroll down to \"Leasing Options\" at the end of the sheet. Select the vendor via the drop down, and then click the \"Apply Change\" button. (US Only)"]
[null,"6. Rates are updated quarterly (or more frequently if necessary). Since it is built-in the quote templates, the downloaded templates always contain the current rates. CAUTION: Make sure any version you've saved to your hard drive are the most current version."]
[null,"7. For the contract document, please contact All-Lines Leasing at 800-477-5855, GE at 800-876-6015, or US Bank at 800-934-7444."]
[]
[null,"Note: Macros – If you encounter a pop-up box bout macros when opening the file you should select “Enable Macros”. You can also go to “Tools>Macros>Security” on your menu bar and change the setting to medium to allow macros. Macros must be enabled for the worksheet to function properly."]
[]
[null,"LOGO:"]
[null,"The “Cover_Letter” tab is not protected and therefore the distributor can put their logos on it. The tennant logo itself on all the machine tabs is not protected, and can be removed if choose to. To remove the logo, just do a single left click on it and press delete.\n"]
[]
[]
[]
[]
[]
[]
[]
[]
[]
[]
[]
[]
[]
[]
[]
[]
[]
[]
[]
[]
[]
[]
[]
[]
[]
[]
[]
[]
[]
[]
[]
[]
[]
[]
[]
[]
[]
[]
[]
[]
[]
[]
[]
[]
[]
[]
[null,null,"or,"]

{"sheet":"Lists","index":20,"n_rows":57,"n_cols":17,"rows_kept":57,"cut":false,"hidden":true,"merged":[]}
["FlexClean Regions",null,null,null,null,null,"Tab Name","Machine","Product",2009,"Material","PH","Type","Rider_WB",null,null,"All Tabs"]
["Description","Region Key",null,null,null,null,"Dual_Tech_ReadySpace_1610",1610,"Comm","Y",9000500,350010080,"Scrubber","WB",null,null,"Specialty"]
["CA - All Other","CA00",null,"Tab name: ","GM_636",null,3640,3640,"Comm","Y","M3640",300020070,"Sweeper","WB",null,null,5680]
["CA - British Columbia","BCCA",null,"Material: ",{"$f":"VLOOKUP($E$3, G2:M98, 5, FALSE)","v":"M636"},null,5400,5400,"Comm","N","M5400",320010110,"Scrubber","WB",null,null,5700]
["US - All Other","US00",null,"Type: ",{"$f":"VLOOKUP($E$3, G2:M99, 7, FALSE)","v":"Sweeper"},null,5680,5680,"Comm","Y","M5680",320020155,"Scrubber","WB",null,null,"T2"]
["US - California","CAUS",null,"Type 2: ",{"$f":"VLOOKUP($E$3, G2:N100, 8, FALSE)","v":"Rider"},null,5700,5700,"Comm","Y","M5700",320020160,"Scrubber","WB",null,null,"T3"]
["US - Conneticut","CTUS",null,null,null,null,6100,6100,"Ind","Y","M6100",300030010,"Sweeper","Rider",null,null,"T3_plus_Orbital"]
["US - DC","DCUS",null,null,null,null,6200,6200,"Ind","Y","M6200",300030020,"Sweeper","Rider",null,null,"T300"]
["US - Massuchusetts","MAUS",null,null,null,null,"6400LC",6400,"Ind","Y","M6400",300040050,"Sweeper","Rider",null,null,"T300e"]
["US - New Jersey","NJUS",null,null,null,null,"6400EV",6400,"Ind","Y","M6400",300040050,"Sweeper","Rider",null,null,"T5"]
["US - New York","NYUS",null,null,null,null,6600,6600,"Ind","N","M6600",300040220,"Sweeper","Rider",null,null,"T5e"]
["US - Pennsylvania","PAUS",null,null,null,null,6650,6650,"Ind","N","M6650",300040230,"Sweeper","Rider",null,null,"T7"]
["US - Rhode Island","RIUS",null,null,null,null,7100,7100,"Ind","Y","M7100",320040005,"Scrubber","Rider",null,null,"T12"]
[null,null,null,null,null,null,7200,7200,"Ind","N","M7200",320040010,"Scrubber","Rider",null,null,7100]
[null,null,null,null,null,null,7300,7300,"Ind","Y","M7300",320050065,"Scrubber","Rider",null,null,"T15"]
[null,null,null,null,null,null,7400,7400,"Ind","N","M7400",320050070,"Scrubber","Rider",null,null,"T16"]
[null,null,null,null,null,null,8210,8210,"Ind","N","M8210",340020060,"Scrubber","Rider",null,null,"T17"]
[null,null,null,null,null,null,8300,8300,"Ind","Y","M8300",340020015,"Scrubber","Rider",null,null,"Orbio 5000-Sc"]
[null,null,null,null,null,null,8410,8410,"Ind","N","M8410",340020030,"Scrubber","Rider",null,null,7300]
[null,null,null,null,null,null,"M20","M20","Ind","Y","M20",340020070,"Scrubber","Rider",null,null,7400]
[null,null,null,null,null,null,"M30","M30","Ind","Y","MM30",340020080,"Scrubber","Rider",null,null,8200]
[null,null,null,null,"Template",null,"T3","T3","Comm","Y",9003577,320010540,"Scrubber","WB",null,null,8210]
[null,null,null,null,"Scrubber",null,"T300","T300","Comm","Y",9003577,320010540,"Scrubber","WB",null,null,8300]
[null,null,null,null,"Sweeper",null,"T300e","T300e","Comm","Y",9003577,320010540,"Scrubber","WB",null,null,8400]
[null,null,null,null,"Nobles",null,"T3_Orbital","T3_Orbital","Comm","Y",9003577,320010540,"Scrubber","WB",null,null,8410]
[null,null,null,null,null,null,"T3_plus_Orbital","T3 +","Comm","Y",9007539,320010540,"Scrubber","WB",null,null,"M17"]
[null,null,null,null,null,null,"T5","T5","Comm","Y","MT5",320020500,"Scrubber","WB",null,null,"M20"]
[null,null,null,null,null,null,"T5e","T5e","Comm","Y","MT5e",320020500,"Scrubber","WB",null,null,"T20"]
[null,null,null,null,null,null,"T7","T7","Comm","Y","MT7",320040050,"Scrubber","Rider",null,null,"M30"]
[null,null,null,null,null,null,"T12","T12","Comm","Y","MT12",320040050,"Scrubber","Rider",null,null,550]
[null,null,null,null,null,null,"T15","T15","Ind","Y","MT15",320040060,"Scrubber","Rider",null,null,1550]
[null,null,null,null,null,null,"T20","T20","Ind","Y","MT20",320050110,"Scrubber","Rider",null,null,"510E"]
[null,null,null,null,null,null,"Dual_Tech_ReadySpace_R14","R14","Comm","Y","MR14",350090010,"Scrubber","Rider",null,null,7200]
[null,null,null,null,null,null,"S8","S8","Comm","Y",9001400,300020200,"Sweeper","WB",null,null,5100]
[null,null,null,null,null,null,"S10","S10","Ind","Y","MS10",300020210,"Sweeper","WB",null,null,5200]
[null,null,null,null,null,null,"S30","S30","Ind","Y","MS30",300040310,"Sweeper","Rider",null,null,5280]
[null,null,null,null,null,null,"DualTech_ReadySpace_Strive","Strive","Comm","Y",9000503,350010090,"Scrubber","WB",null,null,5300]
[null,null,null,null,null,null,"DualTech_ReadySpace_StriveRider","Strive Rider","Comm","Y","Mstriverider",350090020,"Scrubber","Rider",null,null,5400]
[null,null,null,null,null,null,"SS_24_32","SS5","Comm","Y","Mss5",320020510,"Scrubber","WB",null,null,5500]
[null,null,null,null,null,null,550,550,"Ind","Y","M550",320050090,"Scrubber","Rider",null,null,5520]
[null,null,null,null,null,null,1550,1550,"Ind","Y","M1550",320050100,"Scrubber","Rider",null,null,5540]
[null,null,null,null,null,null,"Burnishers",2550,"Comm","Y",9003536,400020018,"Sweeper","WB",null,null,5560]
[null,null,null,null,null,null,"Burnishers",2510,"Comm","Y",9003532,400020018,"Sweeper","WB",null,null,5680]
[null,null,null,null,null,null,"Carpet_Extractors",1510,"Comm","Y",614002,350010040,"Scrubber","WB"]
[null,null,null,null,null,null,"SSR","SSR","Comm","Y","MSSR",null,"Scrubber","Rider"]
[null,null,null,null,null,null,"EZ_Rider","EZ_Rider","Comm","Y","MEZRIDERHP",null,"Scrubber","Rider"]
[null,null,null,null,null,null,"SpeedGleam","SpeedGleam_Plus","Comm","Y",9003538,null,"Sweeper","WB"]
[null,null,null,null,null,null,"SS_17_20","SS17","Comm","Y",9002885,null,"Scrubber","WB"]
[null,null,null,null,null,null,"SS_XC","SS17+","Comm","Y",9007634,null,"Scrubber","WB"]
[null,null,null,null,null,null,"S20_GLPD","S20_GLPD","Ind","Y","MS20",null,"Sweeper","Rider"]
[null,null,null,null,null,null,"S20EV","S20EV","Ind","Y","MS20",null,"Sweeper","Rider"]
[null,null,null,null,null,null,"GM_400","GM_400","Ind","Y","M400",null,"Sweeper","Rider"]
[null,null,null,null,null,null,"GM_636","GM_636","Ind","Y","M636",null,"Sweeper","Rider"]
[null,null,null,null,null,null,800,800,"Ind","Y","M800",null,"Sweeper","Rider"]
[null,null,null,null,null,null,810,810,"Ind","Y","M810",null,"Sweeper","Rider"]
[null,null,null,null,null,null,4300,4300,"Ind","Y","ATLV",null,"Sweeper","Rider"]
[null,null,null,null,null,null,"M17","M17","Ind","Y","M17",340020015,"Scrubber","Rider"]

{"sheet":"TennantTrue Rate","index":21,"n_rows":270,"n_cols":52,"rows_kept":270,"cut":false,"hidden":true,"merged":[[2,32,2,36],[2,37,2,41],[3,32,3,36],[3,37,3,41],[2,2,2,6],[2,12,2,16],[3,2,3,6],[3,12,3,16],[2,7,2,11],[3,7,3,11],[2,27,2,31],[3,27,3,31],[3,17,3,21],[3,22,3,26],[2,17,2,21],[2,22,2,26]]}
["TennantTrue Service Rates",null,null,null,null,null,null,null,null,null,null,null,null,null,null,null,null,null,null,null,null,null,null,null,null,null,null,null,null,null,null,null,"Up Charge",null,"Rider",60,120,"Up Charge",null,"Rider",60,120]
[null,null,null,null,null,null,null,null,null,null,null,null,null,null,null,null,null,null,null,null,null,null,null,null,null,null,null,null,null,null,null,null,null,null,"WB",40,70,null,null,"WB",40,70]
[null,null,"GOLD",null,null,null,null,"GOLD - 36 PRE PAY",null,null,null,null,"SILVER",null,null,null,null,"SILVER - ANNUALLY",null,null,null,null,"SILVER - 36 PRE PAY",null,null,null,null,"SILVER - PER VISIT",null,null,null,null,"GOLD w/AB Brushes",null,null,null,null,"GOLD w/AB Brushes PrePay"]
[null,null,"Term",null,null,null,null,"Term",null,null,null,null,"Term",null,null,null,null,"Term",null,null,null,null,"Term",null,null,null,null,"Term",null,null,null,null,"Term",null,null,null,null,"Term"]
["Model","Hours",36,48,60,72,84,36,48,60,72,84,36,48,60,72,84,36,48,60,72,84,36,48,60,72,84,36,48,60,72,84,36,48,60,72,84,36,48,60,72,84]
[5680,25,75,85,90,null,null,{"$f":"ROUND(((C6*36)*0.93),0)","v":2511},{"$f":"ROUND(((D6*48)*0.93),0)","v":3794},{"$f":"ROUND(((E6*60)*0.93),0)","v":5022},null,null,60,{"$f":"ROUND(M6*1.03,0)","v":62},64,null,null,703,{"$f":"ROUND(R6*1.03,0)","v":724},{"$f":"ROUND(S6*1.03,0)","v":746},null,null,2063,{"$f":"ROUND((W6/3)*1.03*4,0)","v":2833},{"$f":"ROUND((X6/4)*1.03*5,0)","v":3647},null,null,350,360,370,null,null,{"$f":"C6+AJ$2","v":115},{"$f":"D6+AJ$2","v":125},{"$f":"E6+AJ$2","v":130},null,null,{"$f":"ROUND(((AG6*36)*0.93),0)","v":3850},{"$f":"ROUND(((AH6*48)*0.93),0)","v":5580},{"$f":"ROUND(((AI6*60)*0.93),0)","v":7254}]
[5680,40,115,125,130,null,null,{"$f":"ROUND(((C7*36)*0.93),0)","v":3850},{"$f":"ROUND(((D7*48)*0.93),0)","v":5580},{"$f":"ROUND(((E7*60)*0.93),0)","v":7254},null,null,89,92,95,null,null,1049,{"$f":"ROUND(R7*1.03,0)","v":1080},1112,null,null,3080,{"$f":"ROUND((W7/3)*1.03*4,0)","v":4230},{"$f":"ROUND((X7/4)*1.03*5,0)","v":5446},null,null,350,360,370,null,null,{"$f":"C7+AJ$2","v":155},{"$f":"D7+AJ$2","v":165},{"$f":"E7+AJ$2","v":170},null,null,{"$f":"ROUND(((AG7*36)*0.93),0)","v":5189},{"$f":"ROUND(((AH7*48)*0.93),0)","v":7366},{"$f":"ROUND(((AI7*60)*0.93),0)","v":9486}]
[5680,60,170,185,195,null,null,5692,8258,{"$f":"ROUND(((E8*60)*0.93),0)","v":10881},null,null,134,138,142,null,null,1573,1620,1669,null,null,4620,{"$f":"ROUND((W8/3)*1.03*4,0)","v":6345},{"$f":"ROUND((X8/4)*1.03*5,0)","v":8169},null,null,350,360,370,null,null,{"$f":"C8+AJ$2","v":210},{"$f":"D8+AJ$2","v":225},{"$f":"E8+AJ$2","v":235},null,null,{"$f":"ROUND(((AG8*36)*0.93),0)","v":7031},{"$f":"ROUND(((AH8*48)*0.93),0)","v":10044},{"$f":"ROUND(((AI8*60)*0.93),0)","v":13113}]
[5680,80,230,255,null,null,null,7700,11383,null,null,null,178,183,188,null,null,2098,2161,2226,null,null,6160,{"$f":"ROUND((W9/3)*1.03*4,0)","v":8460},{"$f":"ROUND((X9/4)*1.03*5,0)","v":10892},null,null,350,360,370,null,null,{"$f":"C9+AK$2","v":300},{"$f":"D9+AK$2","v":325},null,null,null,{"$f":"ROUND(((AG9*36)*0.93),0)","v":10044},{"$f":"ROUND(((AH9*48)*0.93),0)","v":14508}]
[5680,100,290,null,null,null,null,9709,null,null,null,null,225,232,239,null,null,{"$f":"ROUND((AB10*8)*0.95,0)","v":2660},2740,2822,null,null,{"$f":"ROUND(((AB10*24)*0.93),0)","v":7812},{"$f":"ROUND((W10/3)*1.03*4,0)","v":10728},{"$f":"ROUND((X10/4)*1.03*5,0)","v":13812},null,null,350,360,370,null,null,{"$f":"C10+AK$2","v":360},null,null,null,null,{"$f":"ROUND(((AG10*36)*0.93),0)","v":12053}]
["Specialty",25]
["Specialty",40]
["Specialty",60]
["Specialty",80]
["Specialty",100]
[5700,25,80,90,95,null,null,2678,4018,{"$f":"ROUND(((E16*60)*0.93),0)","v":5301},null,null,60,{"$f":"ROUND(M16*1.03,0)","v":62},64,null,null,703,{"$f":"ROUND(R16*1.03,0)","v":724},746,null,null,2063,{"$f":"ROUND((W16/3)*1.03*4,0)","v":2833},{"$f":"ROUND((X16/4)*1.03*5,0)","v":3647},null,null,350,360,370,null,null,{"$f":"C16+AJ$2","v":120},{"$f":"D16+AJ$2","v":130},{"$f":"E16+AJ$2","v":135},null,null,{"$f":"ROUND(((AG16*36)*0.93),0)","v":4018},{"$f":"ROUND(((AH16*48)*0.93),0)","v":5803},{"$f":"ROUND(((AI16*60)*0.93),0)","v":7533}]
[5700,40,115,125,130,null,null,3850,5580,{"$f":"ROUND(((E17*60)*0.93),0)","v":7254},null,null,89,92,95,null,null,1049,1080,1112,null,null,3080,4230,5446,null,null,350,360,370,null,null,{"$f":"C17+AJ$2","v":155},{"$f":"D17+AJ$2","v":165},{"$f":"E17+AJ$2","v":170},null,null,5189,{"$f":"ROUND(((AH17*48)*0.93),0)","v":7366},{"$f":"ROUND(((AI17*60)*0.93),0)","v":9486}]
[5700,60,175,195,200,null,null,5859,8705,{"$f":"ROUND(((E18*60)*0.93),0)","v":11160},null,null,134,138,142,null,null,1573,1620,1669,null,null,4620,6345,8169,null,null,350,360,370,null,null,{"$f":"C18+AJ$2","v":215},{"$f":"D18+AJ$2","v":235},{"$f":"E18+AJ$2","v":240},null,null,7198,{"$f":"ROUND(((AH18*48)*0.93),0)","v":10490},{"$f":"ROUND(((AI18*60)*0.93),0)","v":13392}]
[5700,80,235,260,null,null,null,7868,11606,null,null,null,178,183,188,null,null,2098,2161,2226,null,null,6160,8460,10892,null,null,350,360,370,null,null,{"$f":"C19+AK$2","v":305},{"$f":"D19+AK$2","v":330},null,null,null,10211,{"$f":"ROUND(((AH19*48)*0.93),0)","v":14731}]
[5700,100,295,null,null,null,null,9877,null,null,null,null,225,232,239,null,null,{"$f":"ROUND((AB20*8)*0.95,0)","v":2660},2740,2822,null,null,{"$f":"ROUND(((AB20*24)*0.93),0)","v":7812},10728,13812,null,null,350,360,370,null,null,{"$f":"C20+AK$2","v":365},null,null,null,null,12220]
["T2",25,70,75,80,null,null,2344,3348,{"$f":"ROUND(((E21*60)*0.93),0)","v":4464},null,null,50,52,54,null,null,592,610,628,null,null,1737,2385,3071,null,null,310,320,330,null,null,{"$f":"C21+AJ$2","v":110},{"$f":"D21+AJ$2","v":115},{"$f":"E21+AJ$2","v":120},null,null,3683,{"$f":"ROUND(((AH21*48)*0.93),0)","v":5134},{"$f":"ROUND(((AI21*60)*0.93),0)","v":6696}]
["T2",40,100,110,115,null,null,3348,4910,{"$f":"ROUND(((E22*60)*0.93),0)","v":6417},null,null,79,81,83,null,null,927,955,984,null,null,2723,3740,4815,null,null,310,320,330,null,null,{"$f":"C22+AJ$2","v":140},{"$f":"D22+AJ$2","v":150},{"$f":"E22+AJ$2","v":155},null,null,4687,{"$f":"ROUND(((AH22*48)*0.93),0)","v":6696},{"$f":"ROUND(((AI22*60)*0.93),0)","v":8649}]
["T2",60,150,165,175,null,null,5022,7366,{"$f":"ROUND(((E23*60)*0.93),0)","v":9765},null,null,118,122,126,null,null,1391,1433,1476,null,null,4085,5610,7223,null,null,310,320,330,null,null,{"$f":"C23+AJ$2","v":190},{"$f":"D23+AJ$2","v":205},{"$f":"E23+AJ$2","v":215},null,null,6361,{"$f":"ROUND(((AH23*48)*0.93),0)","v":9151},{"$f":"ROUND(((AI23*60)*0.93),0)","v":11997}]
["T2",80,205,225,null,null,null,6863,10044,null,null,null,158,163,168,null,null,1854,1910,1967,null,null,5446,7479,9629,null,null,310,320,330,null,null,{"$f":"C24+AK$2","v":275},{"$f":"D24+AK$2","v":295},null,null,null,9207,{"$f":"ROUND(((AH24*48)*0.93),0)","v":13169}]
["T2",100,250,null,null,null,null,8370,null,null,null,null,200,206,212,null,null,{"$f":"ROUND((AB25*8)*0.95,0)","v":2356},2427,2500,null,null,{"$f":"ROUND(((AB25*24)*0.93),0)","v":6919},9502,12234,null,null,310,320,330,null,null,{"$f":"C25+AK$2","v":320},null,null,null,null,10714]
["T3",25,70,75,80,null,null,2344,3348,{"$f":"ROUND(((E26*60)*0.93),0)","v":4464},null,null,50,52,54,null,null,592,610,628,null,null,1737,2385,3071,null,null,310,320,330,null,null,{"$f":"C26+AJ$2","v":110},{"$f":"D26+AJ$2","v":115},{"$f":"E26+AJ$2","v":120},null,null,3683,{"$f":"ROUND(((AH26*48)*0.93),0)","v":5134},{"$f":"ROUND(((AI26*60)*0.93),0)","v":6696}]
["T3",40,100,110,115,null,null,3348,4910,{"$f":"ROUND(((E27*60)*0.93),0)","v":6417},null,null,79,81,83,null,null,927,955,984,null,null,2723,3740,4815,null,null,310,320,330,null,null,{"$f":"C27+AJ$2","v":140},{"$f":"D27+AJ$2","v":150},{"$f":"E27+AJ$2","v":155},null,null,4687,{"$f":"ROUND(((AH27*48)*0.93),0)","v":6696},{"$f":"ROUND(((AI27*60)*0.93),0)","v":8649}]
["T3",60,150,165,175,null,null,5022,7366,{"$f":"ROUND(((E28*60)*0.93),0)","v":9765},null,null,118,122,126,null,null,1391,1433,1476,null,null,4085,5610,7223,null,null,310,320,330,null,null,{"$f":"C28+AJ$2","v":190},{"$f":"D28+AJ$2","v":205},{"$f":"E28+AJ$2","v":215},null,null,6361,{"$f":"ROUND(((AH28*48)*0.93),0)","v":9151},{"$f":"ROUND(((AI28*60)*0.93),0)","v":11997}]
["T3",80,205,225,null,null,null,6863,10044,null,null,null,158,163,168,null,null,1854,1910,1967,null,null,5446,7479,9629,null,null,310,320,330,null,null,{"$f":"C29+AK$2","v":275},{"$f":"D29+AK$2","v":295},null,null,null,9207,{"$f":"ROUND(((AH29*48)*0.93),0)","v":13169}]
["T3",100,250,null,null,null,null,8370,null,null,null,null,200,206,212,null,null,{"$f":"ROUND((AB30*8)*0.95,0)","v":2356},2427,2500,null,null,{"$f":"ROUND(((AB30*24)*0.93),0)","v":6919},9502,12234,null,null,310,320,330,null,null,{"$f":"C30+AK$2","v":320},null,null,null,null,10714]
["T300",25,70,75,80,null,null,2344,{"$f":"ROUND(((D31*48)*0.93),0)","v":3348},{"$f":"ROUND(((E31*60)*0.93),0)","v":4464},null,null,50,52,54,null,null,592,610,628,null,null,1737,2385,3071,null,null,310,320,330,null,null,{"$f":"C31+AJ$2","v":110},{"$f":"D31+AJ$2","v":115},{"$f":"E31+AJ$2","v":120},null,null,3683,{"$f":"ROUND(((AH31*48)*0.93),0)","v":5134},{"$f":"ROUND(((AI31*60)*0.93),0)","v":6696}]
["T300",40,100,110,115,null,null,3348,{"$f":"ROUND(((D32*48)*0.93),0)","v":4910},{"$f":"ROUND(((E32*60)*0.93),0)","v":6417},null,null,79,81,83,null,null,927,{"$f":"ROUND(R32*1.03,0)","v":955},984,null,null,2723,3740,4815,null,null,310,320,330,null,null,{"$f":"C32+AJ$2","v":140},{"$f":"D32+AJ$2","v":150},{"$f":"E32+AJ$2","v":155},null,null,4687,{"$f":"ROUND(((AH32*48)*0.93),0)","v":6696},{"$f":"ROUND(((AI32*60)*0.93),0)","v":8649}]
["T300",60,150,165,175,null,null,5022,{"$f":"ROUND(((D33*48)*0.93),0)","v":7366},{"$f":"ROUND(((E33*60)*0.93),0)","v":9765},null,null,118,122,126,null,null,1391,1433,1476,null,null,4085,5610,7223,null,null,310,320,330,null,null,{"$f":"C33+AJ$2","v":190},{"$f":"D33+AJ$2","v":205},{"$f":"E33+AJ$2","v":215},null,null,6361,{"$f":"ROUND(((AH33*48)*0.93),0)","v":9151},{"$f":"ROUND(((AI33*60)*0.93),0)","v":11997}]
["T300",80,205,225,null,null,null,6863,{"$f":"ROUND(((D34*48)*0.93),0)","v":10044},null,null,null,158,163,168,null,null,1854,1910,1967,null,null,5446,7479,9629,null,null,310,320,330,null,null,{"$f":"C34+AK$2","v":275},{"$f":"D34+AK$2","v":295},null,null,null,9207,{"$f":"ROUND(((AH34*48)*0.93),0)","v":13169}]
["T300",100,250,null,null,null,null,8370,null,null,null,null,200,206,212,null,null,{"$f":"ROUND((AB35*8)*0.95,0)","v":2356},2427,2500,null,null,{"$f":"ROUND(((AB35*24)*0.93),0)","v":6919},9502,12234,null,null,310,320,330,null,null,{"$f":"C35+AK$2","v":320},null,null,null,null,10714]
["T300e",25,70,75,80,null,null,2344,{"$f":"ROUND(((D36*48)*0.93),0)","v":3348},{"$f":"ROUND(((E36*60)*0.93),0)","v":4464},null,null,50,52,54,null,null,592,610,628,null,null,1737,2385,3071,null,null,310,320,330,null,null,{"$f":"C36+AJ$2","v":110},{"$f":"D36+AJ$2","v":115},{"$f":"E36+AJ$2","v":120},null,null,3683,{"$f":"ROUND(((AH36*48)*0.93),0)","v":5134},{"$f":"ROUND(((AI36*60)*0.93),0)","v":6696}]
["T300e",40,100,110,115,null,null,3348,{"$f":"ROUND(((D37*48)*0.93),0)","v":4910},{"$f":"ROUND(((E37*60)*0.93),0)","v":6417},null,null,79,81,83,null,null,927,955,984,null,null,2723,3740,4815,null,null,310,320,330,null,null,{"$f":"C37+AJ$2","v":140},{"$f":"D37+AJ$2","v":150},{"$f":"E37+AJ$2","v":155},null,null,4687,{"$f":"ROUND(((AH37*48)*0.93),0)","v":6696},{"$f":"ROUND(((AI37*60)*0.93),0)","v":8649}]
["T300e",60,150,165,175,null,null,5022,{"$f":"ROUND(((D38*48)*0.93),0)","v":7366},{"$f":"ROUND(((E38*60)*0.93),0)","v":9765},null,null,118,122,126,null,null,1391,1433,1476,null,null,4085,5610,7223,null,null,310,320,330,null,null,{"$f":"C38+AJ$2","v":190},{"$f":"D38+AJ$2","v":205},{"$f":"E38+AJ$2","v":215},null,null,6361,{"$f":"ROUND(((AH38*48)*0.93),0)","v":9151},{"$f":"ROUND(((AI38*60)*0.93),0)","v":11997}]
["T300e",80,205,225,null,null,null,6863,{"$f":"ROUND(((D39*48)*0.93),0)","v":10044},null,null,null,158,163,168,null,null,1854,1910,1967,null,null,5446,7479,9629,null,null,310,320,330,null,null,{"$f":"C39+AK$2","v":275},{"$f":"D39+AK$2","v":295},null,null,null,9207,{"$f":"ROUND(((AH39*48)*0.93),0)","v":13169}]
["T300e",100,250,null,null,null,null,8370,null,null,null,null,200,206,212,null,null,{"$f":"ROUND((AB40*8)*0.95,0)","v":2356},2427,2500,null,null,{"$f":"ROUND(((AB40*24)*0.93),0)","v":6919},9502,12234,null,null,310,320,330,null,null,{"$f":"C40+AK$2","v":320},null,null,null,null,10714]
["T3_Orbital",25,70,75,80,null,null,2344,3348,{"$f":"ROUND(((E41*60)*0.93),0)","v":4464},null,null,50,52,54,null,null,592,610,628,null,null,1737,2385,3071,null,null,310,320,330,null,null,{"$f":"C41+AJ$2","v":110},{"$f":"D41+AJ$2","v":115},{"$f":"E41+AJ$2","v":120},null,null,3683,{"$f":"ROUND(((AH41*48)*0.93),0)","v":5134},{"$f":"ROUND(((AI41*60)*0.93),0)","v":6696}]
["T3_Orbital",40,100,110,115,null,null,3348,4910,{"$f":"ROUND(((E42*60)*0.93),0)","v":6417},null,null,79,81,83,null,null,927,955,984,null,null,2723,3740,4815,null,null,310,320,330,null,null,{"$f":"C42+AJ$2","v":140},{"$f":"D42+AJ$2","v":150},{"$f":"E42+AJ$2","v":155},null,null,4687,{"$f":"ROUND(((AH42*48)*0.93),0)","v":6696},{"$f":"ROUND(((AI42*60)*0.93),0)","v":8649}]
["T3_Orbital",60,150,165,175,null,null,5022,7366,{"$f":"ROUND(((E43*60)*0.93),0)","v":9765},null,null,118,122,126,null,null,1391,1433,1476,null,null,4085,5610,7223,null,null,310,320,330,null,null,{"$f":"C43+AJ$2","v":190},{"$f":"D43+AJ$2","v":205},{"$f":"E43+AJ$2","v":215},null,null,6361,{"$f":"ROUND(((AH43*48)*0.93),0)","v":9151},{"$f":"ROUND(((AI43*60)*0.93),0)","v":11997}]
["T3_Orbital",80,205,225,null,null,null,6863,10044,null,null,null,158,163,168,null,null,1854,1910,1967,null,null,5446,7479,9629,null,null,310,320,330,null,null,{"$f":"C44+AK$2","v":275},{"$f":"D44+AK$2","v":295},null,null,null,9207,{"$f":"ROUND(((AH44*48)*0.93),0)","v":13169}]
["T3_Orbital",100,250,null,null,null,null,8370,null,null,null,null,200,206,212,null,null,{"$f":"ROUND((AB45*8)*0.95,0)","v":2356},2427,2500,null,null,{"$f":"ROUND(((AB45*24)*0.93),0)","v":6919},9502,12234,null,null,310,320,330,null,null,{"$f":"C45+AK$2","v":320},null,null,null,null,10714]
["T3_plus",25,70,75,80,null,null,2344,3348,{"$f":"ROUND(((E46*60)*0.93),0)","v":4464},null,null,50,{"$f":"ROUND(M46*1.03,0)","v":52},54,null,null,592,610,628,null,null,1737,2385,3071,null,null,310,320,330,null,null,{"$f":"C46+AJ$2","v":110},{"$f":"D46+AJ$2","v":115},{"$f":"E46+AJ$2","v":120},null,null,3683,{"$f":"ROUND(((AH46*48)*0.93),0)","v":5134},{"$f":"ROUND(((AI46*60)*0.93),0)","v":6696}]
["T3_plus",40,100,110,115,null,null,3348,4910,{"$f":"ROUND(((E47*60)*0.93),0)","v":6417},null,null,79,81,83,null,null,927,955,984,null,null,2723,3740,4815,null,null,310,320,330,null,null,{"$f":"C47+AJ$2","v":140},{"$f":"D47+AJ$2","v":150},{"$f":"E47+AJ$2","v":155},null,null,4687,{"$f":"ROUND(((AH47*48)*0.93),0)","v":6696},{"$f":"ROUND(((AI47*60)*0.93),0)","v":8649}]
["T3_plus",60,150,165,175,null,null,5022,7366,{"$f":"ROUND(((E48*60)*0.93),0)","v":9765},null,null,118,122,126,null,null,1391,{"$f":"ROUND(R48*1.03,0)","v":1433},1476,null,null,4085,5610,7223,null,null,310,320,330,null,null,{"$f":"C48+AJ$2","v":190},{"$f":"D48+AJ$2","v":205},{"$f":"E48+AJ$2","v":215},null,null,6361,{"$f":"ROUND(((AH48*48)*0.93),0)","v":9151},{"$f":"ROUND(((AI48*60)*0.93),0)","v":11997}]
["T3_plus",80,205,225,null,null,null,6863,10044,null,null,null,158,163,168,null,null,1854,1910,1967,null,null,5446,7479,9629,null,null,310,320,330,null,null,{"$f":"C49+AK$2","v":275},{"$f":"D49+AK$2","v":295},null,null,null,9207,{"$f":"ROUND(((AH49*48)*0.93),0)","v":13169}]
["T3_plus",100,250,null,null,null,null,8370,null,null,null,null,200,206,212,null,null,{"$f":"ROUND((AB50*8)*0.95,0)","v":2356},2427,2500,null,null,{"$f":"ROUND(((AB50*24)*0.93),0)","v":6919},9502,12234,null,null,310,320,330,null,null,{"$f":"C50+AK$2","v":320},null,null,null,null,10714]
["T3_plus_Orbital",25,70,75,80,null,null,2344,3348,{"$f":"ROUND(((E51*60)*0.93),0)","v":4464},null,null,50,52,54,null,null,592,610,628,null,null,1737,2385,3071,null,null,310,320,330,null,null,{"$f":"C51+AJ$2","v":110},{"$f":"D51+AJ$2","v":115},{"$f":"E51+AJ$2","v":120},null,null,3683,{"$f":"ROUND(((AH51*48)*0.93),0)","v":5134},{"$f":"ROUND(((AI51*60)*0.93),0)","v":6696}]
["T3_plus_Orbital",40,100,110,115,null,null,3348,4910,{"$f":"ROUND(((E52*60)*0.93),0)","v":6417},null,null,79,81,83,null,null,927,955,984,null,null,2723,3740,4815,null,null,310,320,330,null,null,{"$f":"C52+AJ$2","v":140},{"$f":"D52+AJ$2","v":150},{"$f":"E52+AJ$2","v":155},null,null,4687,{"$f":"ROUND(((AH52*48)*0.93),0)","v":6696},{"$f":"ROUND(((AI52*60)*0.93),0)","v":8649}]
["T3_plus_Orbital",60,150,165,175,null,null,5022,7366,{"$f":"ROUND(((E53*60)*0.93),0)","v":9765},null,null,118,122,126,null,null,1391,1433,1476,null,null,4085,5610,7223,null,null,310,320,330,null,null,{"$f":"C53+AJ$2","v":190},{"$f":"D53+AJ$2","v":205},{"$f":"E53+AJ$2","v":215},null,null,6361,{"$f":"ROUND(((AH53*48)*0.93),0)","v":9151},{"$f":"ROUND(((AI53*60)*0.93),0)","v":11997}]
["T3_plus_Orbital",80,205,225,null,null,null,6863,10044,null,null,null,158,163,168,null,null,1854,{"$f":"ROUND(R54*1.03,0)","v":1910},1967,null,null,5446,7479,9629,null,null,310,320,330,null,null,{"$f":"C54+AK$2","v":275},{"$f":"D54+AK$2","v":295},null,null,null,9207,{"$f":"ROUND(((AH54*48)*0.93),0)","v":13169}]
["T3_plus_Orbital",100,250,null,null,null,null,8370,null,null,null,null,200,206,212,null,null,{"$f":"ROUND((AB55*8)*0.95,0)","v":2356},2427,2500,null,null,{"$f":"ROUND(((AB55*24)*0.93),0)","v":6919},9502,12234,null,null,310,320,330,null,null,{"$f":"C55+AK$2","v":320},null,null,null,null,10714]
["T5",25,75,85,90,null,null,2511,3794,{"$f":"ROUND(((E56*60)*0.93),0)","v":5022},null,null,50,52,54,null,null,592,610,628,null,null,1737,2385,3071,null,null,310,320,330,null,null,{"$f":"C56+AJ$2","v":115},{"$f":"D56+AJ$2","v":125},{"$f":"E56+AJ$2","v":130},null,null,3850,{"$f":"ROUND(((AH56*48)*0.93),0)","v":5580},{"$f":"ROUND(((AI56*60)*0.93),0)","v":7254}]
["T5",40,105,115,120,null,null,3515,5134,{"$f":"ROUND(((E57*60)*0.93),0)","v":6696},null,null,79,81,83,null,null,927,955,984,null,null,2723,3740,4815,null,null,310,320,330,null,null,{"$f":"C57+AJ$2","v":145},{"$f":"D57+AJ$2","v":155},{"$f":"E57+AJ$2","v":160},null,null,4855,{"$f":"ROUND(((AH57*48)*0.93),0)","v":6919},{"$f":"ROUND(((AI57*60)*0.93),0)","v":8928}]
["T5",60,160,175,185,null,null,5357,7812,{"$f":"ROUND(((E58*60)*0.93),0)","v":10323},null,null,118,122,126,null,null,1391,1433,1476,null,null,4085,5610,7223,null,null,310,320,330,null,null,{"$f":"C58+AJ$2","v":200},{"$f":"D58+AJ$2","v":215},{"$f":"E58+AJ$2","v":225},null,null,6696,{"$f":"ROUND(((AH58*48)*0.93),0)","v":9598},{"$f":"ROUND(((AI58*60)*0.93),0)","v":12555}]
["T5",80,220,240,null,null,null,7366,10714,null,null,null,158,163,168,null,null,1854,1910,1967,null,null,5446,7479,9629,null,null,310,320,330,null,null,{"$f":"C59+AK$2","v":290},{"$f":"D59+AK$2","v":310},null,null,null,9709,{"$f":"ROUND(((AH59*48)*0.93),0)","v":13838}]
["T5",100,280,null,null,null,null,9374,null,null,null,null,200,206,212,null,null,{"$f":"ROUND((AB60*8)*0.95,0)","v":2356},2427,2500,null,null,{"$f":"ROUND(((AB60*24)*0.93),0)","v":6919},9502,12234,null,null,310,320,330,null,null,{"$f":"C60+AK$2","v":350},null,null,null,null,11718]
["T5e",25,75,85,90,null,null,{"$f":"ROUND(((C61*36)*0.93),0)","v":2511},{"$f":"ROUND(((D61*48)*0.93),0)","v":3794},{"$f":"ROUND(((E61*60)*0.93),0)","v":5022},null,null,50,52,54,null,null,592,610,628,null,null,1737,{"$f":"ROUND((W61/3)*1.03*4,0)","v":2385},{"$f":"ROUND((X61/4)*1.03*5,0)","v":3071},null,null,310,320,330,null,null,{"$f":"C61+AJ$2","v":115},{"$f":"D61+AJ$2","v":125},{"$f":"E61+AJ$2","v":130},null,null,{"$f":"ROUND(((AG61*36)*0.93),0)","v":3850},{"$f":"ROUND(((AH61*48)*0.93),0)","v":5580},{"$f":"ROUND(((AI61*60)*0.93),0)","v":7254}]
["T5e",40,105,115,120,null,null,{"$f":"ROUND(((C62*36)*0.93),0)","v":3515},{"$f":"ROUND(((D62*48)*0.93),0)","v":5134},{"$f":"ROUND(((E62*60)*0.93),0)","v":6696},null,null,79,81,83,null,null,927,955,984,null,null,2723,{"$f":"ROUND((W62/3)*1.03*4,0)","v":3740},{"$f":"ROUND((X62/4)*1.03*5,0)","v":4815},null,null,310,320,330,null,null,{"$f":"C62+AJ$2","v":145},{"$f":"D62+AJ$2","v":155},{"$f":"E62+AJ$2","v":160},null,null,{"$f":"ROUND(((AG62*36)*0.93),0)","v":4855},{"$f":"ROUND(((AH62*48)*0.93),0)","v":6919},{"$f":"ROUND(((AI62*60)*0.93),0)","v":8928}]
["T5e",60,160,175,185,null,null,{"$f":"ROUND(((C63*36)*0.93),0)","v":5357},{"$f":"ROUND(((D63*48)*0.93),0)","v":7812},{"$f":"ROUND(((E63*60)*0.93),0)","v":10323},null,null,118,122,126,null,null,1391,1433,1476,null,null,4085,{"$f":"ROUND((W63/3)*1.03*4,0)","v":5610},{"$f":"ROUND((X63/4)*1.03*5,0)","v":7223},null,null,310,320,330,null,null,{"$f":"C63+AJ$2","v":200},{"$f":"D63+AJ$2","v":215},{"$f":"E63+AJ$2","v":225},null,null,{"$f":"ROUND(((AG63*36)*0.93),0)","v":6696},{"$f":"ROUND(((AH63*48)*0.93),0)","v":9598},{"$f":"ROUND(((AI63*60)*0.93),0)","v":12555}]
["T5e",80,220,240,null,null,null,{"$f":"ROUND(((C64*36)*0.93),0)","v":7366},{"$f":"ROUND(((D64*48)*0.93),0)","v":10714},null,null,null,158,163,168,null,null,1854,1910,1967,null,null,5446,{"$f":"ROUND((W64/3)*1.03*4,0)","v":7479},{"$f":"ROUND((X64/4)*1.03*5,0)","v":9629},null,null,310,320,330,null,null,{"$f":"C64+AK$2","v":290},{"$f":"D64+AK$2","v":310},null,null,null,{"$f":"ROUND(((AG64*36)*0.93),0)","v":9709},{"$f":"ROUND(((AH64*48)*0.93),0)","v":13838}]
["T5e",100,280,null,null,null,null,{"$f":"ROUND(((C65*36)*0.93),0)","v":9374},null,null,null,null,200,206,212,null,null,{"$f":"ROUND((AB65*8)*0.95,0)","v":2356},2427,2500,null,null,{"$f":"ROUND(((AB65*24)*0.93),0)","v":6919},{"$f":"ROUND((W65/3)*1.03*4,0)","v":9502},{"$f":"ROUND((X65/4)*1.03*5,0)","v":12234},null,null,310,320,330,null,null,{"$f":"C65+AK$2","v":350},null,null,null,null,{"$f":"ROUND(((AG65*36)*0.93),0)","v":11718}]
["T7",25,100,110,115,null,null,3348,4910,{"$f":"ROUND(((E66*60)*0.93),0)","v":6417},null,null,64,66,68,null,null,755,778,801,null,null,2217,3045,3920,null,null,365,375,385,null,null,{"$f":"C66+AJ$1","v":160},{"$f":"D66+AJ$1","v":170},{"$f":"E66+AJ$1","v":175},null,null,5357,{"$f":"ROUND(((AH66*48)*0.93),0)","v":7589},{"$f":"ROUND(((AI66*60)*0.93),0)","v":9765}]
["T7",40,140,155,160,null,null,4687,6919,{"$f":"ROUND(((E67*60)*0.93),0)","v":8928},null,null,102,105,108,null,null,1200,1236,1273,null,null,3525,4841,6233,null,null,365,375,385,null,null,{"$f":"C67+AJ$1","v":200},{"$f":"D67+AJ$1","v":215},{"$f":"E67+AJ$1","v":220},null,null,6696,{"$f":"ROUND(((AH67*48)*0.93),0)","v":9598},{"$f":"ROUND(((AI67*60)*0.93),0)","v":12276}]
["T7",60,210,230,240,null,null,7031,10267,{"$f":"ROUND(((E68*60)*0.93),0)","v":13392},null,null,154,159,164,null,null,1806,1860,1916,null,null,5303,7283,9377,null,null,365,375,385,null,null,{"$f":"C68+AJ$1","v":270},{"$f":"D68+AJ$1","v":290},{"$f":"E68+AJ$1","v":300},null,null,9040,{"$f":"ROUND(((AH68*48)*0.93),0)","v":12946},{"$f":"ROUND(((AI68*60)*0.93),0)","v":16740}]
["T7",80,285,315,null,null,null,9542,14062,null,null,null,205,211,217,null,null,2413,2485,2560,null,null,7085,9730,12527,null,null,365,375,385,null,null,{"$f":"C69+AK$1","v":405},{"$f":"D69+AK$1","v":435},null,null,null,13559,{"$f":"ROUND(((AH69*48)*0.93),0)","v":19418}]
["T7",100,360,null,null,null,null,12053,null,null,null,null,240,247,254,null,null,{"$f":"ROUND(((AB70*10)*0.95)*0.88,0)","v":3051},3143,3237,null,null,{"$f":"ROUND(((AB69*30)*0.93)*0.86,0)","v":8758},12028,15486,null,null,365,375,385,null,null,{"$f":"C70+AK$1","v":480},null,null,null,null,16070]
[7100,25,null,null,null,null,null,null,null,null,null,null,64,{"$f":"ROUND(M71*1.03,0)","v":66},68,null,null,755,778,801,null,null,2217,3045,3920,null,null,365,375,385]
[7100,40,null,null,null,null,null,null,null,null,null,null,102,105,108,null,null,1200,1236,1273,null,null,3525,4841,6233,null,null,365,375,385]
[7100,60,null,null,null,null,null,null,null,null,null,null,154,159,164,null,null,1806,1860,1916,null,null,5303,7283,9377,null,null,365,375,385]
[7100,80,null,null,null,null,null,null,null,null,null,null,205,211,217,null,null,2413,2485,2560,null,null,7085,9730,12527,null,null,365,375,385]
[7100,100,null,null,null,null,null,null,null,null,null,null,240,247,254,null,null,{"$f":"ROUND(((AB75*10)*0.95)*0.88,0)","v":3051},3143,3237,null,null,{"$f":"ROUND(((AB74*30)*0.93)*0.86,0)","v":8758},12028,15486,null,null,365,375,385]
[7100,125,null,null,null,null,null,null,null,null,null,null,350,361,372,null,null,null,null,null,null,null,null,null,null,null,null,365,375,385]
[7100,150,null,null,null,null,null,null,null,null,null,null,405,417,430,null,null,null,null,null,null,null,null,null,null,null,null,365,375,385]
["T12",25,110,120,125,null,null,3683,5357,{"$f":"ROUND(((E78*60)*0.93),0)","v":6975},null,null,64,66,68,null,null,755,{"$f":"ROUND(R78*1.03,0)","v":778},801,null,null,2217,{"$f":"ROUND((W78/3)*1.03*4,0)","v":3045},{"$f":"ROUND((X78/4)*1.03*5,0)","v":3920},null,null,365,375,385,null,null,{"$f":"C78+AJ$1","v":170},{"$f":"D78+AJ$1","v":180},{"$f":"E78+AJ$1","v":185},null,null,{"$f":"ROUND(((AG78*36)*0.93),0)","v":5692},{"$f":"ROUND(((AH78*48)*0.93),0)","v":8035},{"$f":"ROUND(((AI78*60)*0.93),0)","v":10323}]
["T12",40,165,180,190,null,null,5524,8035,{"$f":"ROUND(((E79*60)*0.93),0)","v":10602},null,null,102,105,108,null,null,1200,1236,1273,null,null,3525,4841,6233,null,null,365,375,385,null,null,{"$f":"C79+AJ$1","v":225},{"$f":"D79+AJ$1","v":240},{"$f":"E79+AJ$1","v":250},null,null,7533,10714,{"$f":"ROUND(((AI79*60)*0.93),0)","v":13950}]
["T12",60,255,280,295,null,null,8537,12499,{"$f":"ROUND(((E80*60)*0.93),0)","v":16461},null,null,154,159,164,null,null,1806,1860,1916,null,null,5303,7283,9377,null,null,365,375,385,null,null,{"$f":"C80+AJ$1","v":315},{"$f":"D80+AJ$1","v":340},{"$f":"E80+AJ$1","v":355},null,null,10546,15178,{"$f":"ROUND(((AI80*60)*0.93),0)","v":19809}]
["T12",80,350,385,400,null,null,11718,17186,{"$f":"ROUND(((E81*60)*0.93),0)","v":22320},null,null,205,211,217,null,null,2413,2485,2560,null,null,7085,9730,12527,null,null,365,375,385,null,null,{"$f":"C81+AK$1","v":470},{"$f":"D81+AK$1","v":505},{"$f":"E81+AK$1","v":520},null,null,15736,22543,{"$f":"ROUND(((AI81*60)*0.93),0)","v":29016}]
["T12",100,405,445,465,null,null,13559,19865,{"$f":"ROUND(((E82*60)*0.93),0)","v":25947},null,null,240,247,254,null,null,{"$f":"ROUND(((AB82*10)*0.95)*0.88,0)","v":3051},3143,3237,null,null,{"$f":"ROUND(((AB81*30)*0.93)*0.86,0)","v":8758},12028,15486,null,null,365,375,385,null,null,{"$f":"C82+AK$1","v":525},{"$f":"D82+AK$1","v":565},{"$f":"E82+AK$1","v":585},null,null,17577,25222,{"$f":"ROUND(((AI82*60)*0.93),0)","v":32643}]
["T12",125,450,495,null,null,null,15066,22097,null,null,null,350,361,372,null,null,{"$f":"ROUND(((AB83*12)*0.95)*0.88,0)","v":3662},3772,3885,null,null,{"$f":"ROUND(((AB82*36)*0.93)*0.86,0)","v":10509},14432,18581,null,null,365,375,385,null,null,{"$f":"C83+AK$1","v":570},{"$f":"D83+AK$1","v":615},null,null,null,19084,27454]
["T12",150,500,null,null,null,null,16740,null,null,null,null,405,417,430,null,null,{"$f":"ROUND(((AB84*14)*0.95)*0.88,0)","v":4272},4400,4532,null,null,{"$f":"ROUND(((AB83*42)*0.93)*0.86,0)","v":12261},16838,21679,null,null,365,375,385,null,null,{"$f":"C84+AK$1","v":620},null,null,null,null,20758]
["T15",25,null,null,null,null,null,null,null,null,null,null,93,96,99,null,null,1097,1130,1164,null,null,3223,4426,5698,null,null,445,460,475]
["T15",40,null,null,null,null,null,null,null,null,null,null,145,149,153,null,null,1699,1750,1803,null,null,4989,6852,8822,null,null,445,460,475]
["T15",60,null,null,null,null,null,null,null,null,null,null,215,221,228,null,null,2525,2601,2679,null,null,7416,10185,13113,null,null,445,460,475]
["T15",80,null,null,null,null,null,null,null,null,null,null,290,299,308,null,null,3410,3512,3617,null,null,10015,13754,17708,null,null,445,460,475]
["T15",100,null,null,null,null,null,null,null,null,null,null,360,371,382,null,null,4237,4364,4495,null,null,12442,17087,22000,null,null,445,460,475]
["T15",125,null,null,null,null,null,null,null,null,null,null,430,443,456,null,null,{"$f":"ROUND(((AB90*12)*0.95),0)","v":5073},5225,5382,null,null,{"$f":"ROUND(((AB90*36)*0.97),0)","v":15539},21340,27475,null,null,445,460,475]
["T15",150,null,null,null,null,null,null,null,null,null,null,505,{"$f":"ROUND(M91*1.03,0)","v":520},536,null,null,{"$f":"ROUND(((AB91*14)*0.95),0)","v":5919},6097,6280,null,null,{"$f":"ROUND(((AB91*42)*0.97),0)","v":18129},24897,32055,null,null,445,460,475]
["T16",25,125,140,145,null,null,{"$f":"ROUND(((C92*36)*0.93),0)","v":4185},{"$f":"ROUND(((D92*48)*0.93),0)","v":6250},{"$f":"ROUND(((E92*60)*0.93),0)","v":8091},null,null,93,96,99,null,null,1097,1130,1164,null,null,3223,4426,5698,null,null,445,460,475,null,null,{"$f":"C92+AJ$1","v":185},{"$f":"D92+AJ$1","v":200},{"$f":"E92+AJ$1","v":205},null,null,{"$f":"ROUND(((AG92*36)*0.93),0)","v":6194},{"$f":"ROUND(((AH92*48)*0.93),0)","v":8928},{"$f":"ROUND(((AI92*60)*0.93),0)","v":11439}]
["T16",40,180,200,205,null,null,6026,8928,{"$f":"ROUND(((E93*60)*0.93),0)","v":11439},null,null,145,149,153,null,null,1699,1750,1803,null,null,4989,6852,8822,null,null,445,460,475,null,null,{"$f":"C93+AJ$1","v":240},{"$f":"D93+AJ$1","v":260},{"$f":"E93+AJ$1","v":265},null,null,8035,11606,{"$f":"ROUND(((AI93*60)*0.93),0)","v":14787}]
["T16",60,280,310,320,null,null,9374,13838,{"$f":"ROUND(((E94*60)*0.93),0)","v":17856},null,null,215,221,228,null,null,2525,2601,2679,null,null,7416,10185,13113,null,null,445,460,475,null,null,{"$f":"C94+AJ$1","v":340},{"$f":"D94+AJ$1","v":370},{"$f":"E94+AJ$1","v":380},null,null,11383,16517,{"$f":"ROUND(((AI94*60)*0.93),0)","v":21204}]
["T16",80,380,420,435,null,null,12722,18749,{"$f":"ROUND(((E95*60)*0.93),0)","v":24273},null,null,290,299,308,null,null,3410,3512,3617,null,null,10015,13754,17708,null,null,445,460,475,null,null,{"$f":"C95+AK$1","v":500},{"$f":"D95+AK$1","v":540},{"$f":"E95+AK$1","v":555},null,null,16740,24106,{"$f":"ROUND(((AI95*60)*0.93),0)","v":30969}]
["T16",100,455,500,525,null,null,15233,22320,{"$f":"ROUND(((E96*60)*0.93),0)","v":29295},null,null,360,371,382,null,null,4237,4364,4495,null,null,12442,17087,22000,null,null,445,460,475,null,null,{"$f":"C96+AK$1","v":575},{"$f":"D96+AK$1","v":620},{"$f":"E96+AK$1","v":645},null,null,19251,27677,{"$f":"ROUND(((AI96*60)*0.93),0)","v":35991}]
["T16",125,530,585,null,null,null,17744,26114,null,null,null,430,443,456,null,null,{"$f":"ROUND(((AB97*12)*0.95),0)","v":5073},5225,5382,null,null,{"$f":"ROUND(((AB97*36)*0.97),0)","v":15539},21340,27475,null,null,445,460,475,null,null,{"$f":"C97+AK$1","v":650},{"$f":"D97+AK$1","v":705},null,null,null,21762,31471]
["T16",150,600,null,null,null,null,20088,null,null,null,null,505,520,536,null,null,{"$f":"ROUND(((AB98*14)*0.95),0)","v":5919},6097,6280,null,null,{"$f":"ROUND(((AB98*42)*0.97),0)","v":18129},24897,32055,null,null,445,460,475,null,null,{"$f":"C98+AK$1","v":720},null,null,null,null,24106]
["T17",25,130,145,150,null,null,4352,{"$f":"ROUND(((D99*48)*0.93),0)","v":6473},{"$f":"ROUND(((E99*60)*0.93),0)","v":8370},null,null,105,108,111,null,null,{"$f":"M99*12*(0.95)","v":1197},{"$f":"ROUND(R99*1.03,0)","v":1233},1270,null,null,{"$f":"(AB99*3*3)*0.93","v":4101.3},5632,7251,null,null,490,505,520,null,null,{"$f":"C99+AJ$1","v":190},{"$f":"D99+AJ$1","v":205},{"$f":"E99+AJ$1","v":210},null,null,{"$f":"ROUND(((AG99*36)*0.93),0)","v":6361},{"$f":"ROUND(((AH99*48)*0.93),0)","v":9151},{"$f":"ROUND(((AI99*60)*0.93),0)","v":11718},null,null,null,{"$f":"W99","v":4101.3},{"$f":"R99","v":1197},{"$f":"M99","v":105},{"$f":"AB99","v":490},null,null,null,null,{"$f":"N99","v":108}]
["T17",40,195,220,225,null,null,6529,9821,{"$f":"ROUND(((E100*60)*0.93),0)","v":12555},null,null,160,165,170,null,null,{"$f":"M100*12*(0.95)","v":1824},{"$f":"ROUND(R100*1.03,0)","v":1879},1935,null,null,{"$f":"(AB100*3*4)*0.93","v":5468.4000000000005},7510,9669,null,null,490,505,520,null,null,{"$f":"C100+AJ$1","v":255},{"$f":"D100+AJ$1","v":280},{"$f":"E100+AJ$1","v":285},null,null,{"$f":"ROUND(((AG100*36)*0.93),0)","v":8537},12499,{"$f":"ROUND(((AI100*60)*0.93),0)","v":15903},null,null,null,5468.4000000000005,1824,160,490,null,null,null,null,165]
["T17",60,310,340,355,null,null,10379,15178,{"$f":"ROUND(((E101*60)*0.93),0)","v":19809},null,null,240,247,254,null,null,2736,2818,2903,null,null,{"$f":"(AB101*3*6)*0.93","v":8202.6},11265,14504,null,null,490,505,520,null,null,{"$f":"C101+AJ$1","v":370},{"$f":"D101+AJ$1","v":400},{"$f":"E101+AJ$1","v":415},null,null,12388,17856,{"$f":"ROUND(((AI101*60)*0.93),0)","v":23157},null,null,null,8202.6,2736,240,490,null,null,null,null,247]
["T17",80,405,455,475,null,null,13559,20311,{"$f":"ROUND(((E102*60)*0.93),0)","v":26505},null,null,325,335,345,null,null,3705,3816,3930,null,null,{"$f":"(AB102*3*8)*0.93","v":10936.800000000001},15020,19338,null,null,490,505,520,null,null,{"$f":"C102+AK$1","v":525},{"$f":"D102+AK$1","v":575},{"$f":"E102+AK$1","v":595},null,null,17577,25668,{"$f":"ROUND(((AI102*60)*0.93),0)","v":33201},null,null,null,10936.800000000001,3705,325,490,null,null,null,null,335]
["T17",100,500,555,590,null,null,16740,24775,{"$f":"ROUND(((E103*60)*0.93),0)","v":32922},null,null,395,407,419,null,null,4503,4638,4777,null,null,{"$f":"(AB103*3*10)*0.93","v":13671},18775,24173,null,null,490,505,520,null,null,{"$f":"C103+AK$1","v":620},{"$f":"D103+AK$1","v":675},{"$f":"E103+AK$1","v":710},null,null,20758,30132,{"$f":"ROUND(((AI103*60)*0.93),0)","v":39618},null,null,null,13671,4503,395,490,null,null,null,null,407]
["T17",125,605,665,null,null,null,20255,29686,null,null,null,480,494,509,null,null,5472,5636,5805,null,null,{"$f":"(AB104*12*3)*0.93","v":16405.2},22530,29007,null,null,490,505,520,null,null,{"$f":"C104+AK$1","v":725},{"$f":"D104+AK$1","v":785},null,null,null,24273,35042,null,null,null,null,16405.2,5472,480,490,null,null,null,null,494]
["T17",150,700,null,null,null,null,23436,null,null,null,null,560,577,594,null,null,6384,6576,6773,null,null,{"$f":"(AB105*14*3)*0.93","v":19139.400000000001},26285,33842,null,null,490,505,520,null,null,{"$f":"C105+AK$1","v":820},null,null,null,null,27454,null,null,null,null,null,19139.400000000001,6384,560,490,null,null,null,null,577]
[7300,25,135,150,155,null,null,4520,{"$f":"ROUND(((D106*48)*0.93),0)","v":6696},{"$f":"ROUND(((E106*60)*0.93),0)","v":8649},null,null,109,112,115,null,null,1280,1318,1358,null,null,3760,5164,6649,null,null,515,530,545,null,null,{"$f":"C106+AJ$1","v":195},{"$f":"D106+AJ$1","v":210},{"$f":"E106+AJ$1","v":215},null,null,6529,9374,{"$f":"ROUND(((AI106*60)*0.93),0)","v":11997}]
[7300,40,205,225,235,null,null,6863,10044,{"$f":"ROUND(((E107*60)*0.93),0)","v":13113},null,null,165,170,175,null,null,1942,2000,2060,null,null,5706,7836,10089,null,null,515,530,545,null,null,{"$f":"C107+AJ$1","v":265},{"$f":"D107+AJ$1","v":285},{"$f":"E107+AJ$1","v":295},null,null,8872,12722,{"$f":"ROUND(((AI107*60)*0.93),0)","v":16461}]
[7300,60,320,350,370,null,null,10714,15624,{"$f":"ROUND(((E108*60)*0.93),0)","v":20646},null,null,250,258,266,null,null,2944,3032,3123,null,null,8646,11874,15288,null,null,515,530,545,null,null,{"$f":"C108+AJ$1","v":380},{"$f":"D108+AJ$1","v":410},{"$f":"E108+AJ$1","v":430},null,null,12722,18302,{"$f":"ROUND(((AI108*60)*0.93),0)","v":23994}]
[7300,80,425,470,490,null,null,14229,20981,{"$f":"ROUND(((E109*60)*0.93),0)","v":27342},null,null,335,345,355,null,null,3932,4050,4172,null,null,11549,15861,20421,null,null,515,530,545,null,null,{"$f":"C109+AK$1","v":545},{"$f":"D109+AK$1","v":590},{"$f":"E109+AK$1","v":610},null,null,18247,26338,{"$f":"ROUND(((AI109*60)*0.93),0)","v":34038}]
[7300,100,520,570,600,null,null,17410,25445,{"$f":"ROUND(((E110*60)*0.93),0)","v":33480},null,null,415,427,440,null,null,4874,5020,5171,null,null,14315,19659,25311,null,null,515,530,545,null,null,{"$f":"C110+AK$1","v":640},{"$f":"D110+AK$1","v":690},{"$f":"E110+AK$1","v":720},null,null,21427,30802,{"$f":"ROUND(((AI110*60)*0.93),0)","v":40176}]
[7300,125,620,680,null,null,null,20758,30355,null,null,null,500,515,530,null,null,{"$f":"ROUND(((AB111*12)*0.95),0)","v":5871},6047,6228,null,null,{"$f":"ROUND(((AB111*36)*0.97),0)","v":17984},24698,31799,null,null,515,530,545,null,null,{"$f":"C111+AK$1","v":740},{"$f":"D111+AK$1","v":800},null,null,null,24775,35712]
[7300,150,720,null,null,null,null,24106,null,null,null,null,585,603,621,null,null,{"$f":"ROUND(((AB112*14)*0.95),0)","v":6850},7056,7268,null,null,{"$f":"ROUND(((AB112*42)*0.97),0)","v":20981},28814,37098,null,null,515,530,545,null,null,{"$f":"C112+AK$1","v":840},null,null,null,null,28123]
[7400,25,null,null,null,null,null,null,null,null,null,null,120,124,128,null,null,1405,1447,1490,null,null,4127,5668,7298,null,null,570,585,600]
[7400,40,null,null,null,null,null,null,null,null,null,null,185,191,197,null,null,2179,2244,2311,null,null,6399,8788,11315,null,null,570,585,600]
[7400,60,null,null,null,null,null,null,null,null,null,null,275,283,291,null,null,3233,3330,3430,null,null,9494,13038,16786,null,null,570,585,600]
[7400,80,null,null,null,null,null,null,null,null,null,null,370,381,392,null,null,4345,4475,4609,null,null,12761,17525,22563,null,null,570,585,600]
[7400,100,null,null,null,null,null,null,null,null,null,null,460,474,488,null,null,5412,5574,5741,null,null,15893,21826,28101,null,null,570,585,600]
[7400,125,null,null,null,null,null,null,null,null,null,null,555,{"$f":"ROUND(M118*1.03,0)","v":572},589,null,null,{"$f":"ROUND(((AB118*12)*0.95),0)","v":6498},6693,6894,null,null,{"$f":"ROUND(((AB118*36)*0.97),0)","v":19904},27335,35194,null,null,570,585,600]
[7400,150,null,null,null,null,null,null,null,null,null,null,645,664,684,null,null,{"$f":"ROUND(((AB119*14)*0.95),0)","v":7581},7808,8042,null,null,{"$f":"ROUND(((AB119*42)*0.97),0)","v":23222},31892,41061,null,null,570,585,600]
[8200,25,null,null,null,null,null,null,null,null,null,null,123,127,131,null,null,1440,1483,1527,null,null,4228,5806,7475,null,null,580,595,610]
[8200,40,null,null,null,null,null,null,null,null,null,null,190,196,202,null,null,2239,2306,2375,null,null,6575,9030,11626,null,null,580,595,610]
[8200,60,null,null,null,null,null,null,null,null,null,null,280,288,297,null,null,3287,3386,3488,null,null,9654,13258,17070,null,null,580,595,610]
[8200,80,null,null,null,null,null,null,null,null,null,null,375,386,398,null,null,4407,4539,4675,null,null,12942,17774,22884,null,null,580,595,610]
[8200,100,null,null,null,null,null,null,null,null,null,null,470,484,499,null,null,5526,5692,5863,null,null,16230,22289,28697,null,null,580,595,610]
[8200,125,null,null,null,null,null,null,null,null,null,null,565,582,599,null,null,{"$f":"ROUND(((AB125*12)*0.95),0)","v":6612},6810,7014,null,null,{"$f":"ROUND(((AB125*36)*0.97),0)","v":20254},27815,35812,null,null,580,595,610]
[8200,150,null,null,null,null,null,null,null,null,null,null,655,675,695,null,null,{"$f":"ROUND(((AB126*14)*0.95),0)","v":7714},7945,8183,null,null,{"$f":"ROUND(((AB126*42)*0.97),0)","v":23629},32450,41779,null,null,580,595,610]
[8210,25,null,null,null,null,null,null,null,null,null,null,123,127,131,null,null,1440,1483,1527,null,null,4228,5806,7475,null,null,580,595,610]
[8210,40,null,null,null,null,null,null,null,null,null,null,190,196,202,null,null,2239,2306,2375,null,null,6575,9030,11626,null,null,580,595,610]
[8210,60,null,null,null,null,null,null,null,null,null,null,280,288,297,null,null,3287,3386,3488,null,null,9654,13258,17070,null,null,580,595,610]
[8210,80,null,null,null,null,null,null,null,null,null,null,375,386,398,null,null,4407,4539,4675,null,null,12942,17774,22884,null,null,580,595,610]
[8210,100,null,null,null,null,null,null,null,null,null,null,470,484,499,null,null,5526,5692,5863,null,null,16230,22289,28697,null,null,580,595,610]
[8210,125,null,null,null,null,null,null,null,null,null,null,565,582,599,null,null,{"$f":"ROUND(((AB132*12)*0.95),0)","v":6612},6810,7014,null,null,{"$f":"ROUND(((AB132*36)*0.97),0)","v":20254},27815,35812,null,null,580,595,610]
[8210,150,null,null,null,null,null,null,null,null,null,null,655,675,695,null,null,{"$f":"ROUND(((AB133*14)*0.95),0)","v":7714},7945,8183,null,null,{"$f":"ROUND(((AB133*42)*0.97),0)","v":23629},32450,41779,null,null,580,595,610]
[8300,25,155,170,180,null,null,5189,{"$f":"ROUND(((D134*48)*0.93),0)","v":7589},{"$f":"ROUND(((E134*60)*0.93),0)","v":10044},null,null,117,121,125,null,null,1371,1412,1454,null,null,4027,5530,7120,null,null,555,570,585,null,null,{"$f":"C134+AJ$1","v":215},{"$f":"D134+AJ$1","v":230},{"$f":"E134+AJ$1","v":240},null,null,{"$f":"ROUND(((AG134*36)*0.93),0)","v":7198},{"$f":"ROUND(((AH134*48)*0.93),0)","v":10267},{"$f":"ROUND(((AI134*60)*0.93),0)","v":13392}]
[8300,40,240,265,275,null,null,8035,11830,{"$f":"ROUND(((E135*60)*0.93),0)","v":15345},null,null,180,185,191,null,null,2112,2175,2240,null,null,6202,8517,10966,null,null,555,570,585,null,null,{"$f":"C135+AJ$1","v":300},{"$f":"D135+AJ$1","v":325},{"$f":"E135+AJ$1","v":335},null,null,10044,14508,{"$f":"ROUND(((AI135*60)*0.93),0)","v":18693}]
[8300,60,365,400,420,null,null,12220,17856,{"$f":"ROUND(((E136*60)*0.93),0)","v":23436},null,null,279,287,296,null,null,3280,3378,3479,null,null,9633,13229,17032,null,null,555,570,585,null,null,{"$f":"C136+AJ$1","v":425},{"$f":"D136+AJ$1","v":460},{"$f":"E136+AJ$1","v":480},null,null,14229,20534,{"$f":"ROUND(((AI136*60)*0.93),0)","v":26784}]
[8300,80,495,545,570,null,null,16573,24329,{"$f":"ROUND(((E137*60)*0.93),0)","v":31806},null,null,360,371,382,null,null,4237,4364,4495,null,null,12442,17087,22000,null,null,555,570,585,null,null,{"$f":"C137+AK$1","v":615},{"$f":"D137+AK$1","v":665},{"$f":"E137+AK$1","v":690},null,null,20590,29686,{"$f":"ROUND(((AI137*60)*0.93),0)","v":38502}]
[8300,100,605,665,695,null,null,20255,29686,{"$f":"ROUND(((E138*60)*0.93),0)","v":38781},null,null,450,{"$f":"ROUND(M138*1.03,0)","v":464},478,null,null,5286,5445,5608,null,null,15524,21320,27450,null,null,555,570,585,null,null,{"$f":"C138+AK$1","v":725},{"$f":"D138+AK$1","v":785},{"$f":"E138+AK$1","v":815},null,null,24273,35042,{"$f":"ROUND(((AI138*60)*0.93),0)","v":45477}]
[8300,125,700,770,null,null,null,23436,34373,null,null,null,540,556,573,null,null,{"$f":"ROUND(((AB139*12)*0.95),0)","v":6327},6517,6713,null,null,{"$f":"ROUND(((AB139*36)*0.97),0)","v":19381},26617,34269,null,null,555,570,585,null,null,{"$f":"C139+AK$1","v":820},{"$f":"D139+AK$1","v":890},null,null,null,27454,39730]
[8300,150,800,null,null,null,null,26784,null,null,null,null,630,649,668,null,null,{"$f":"ROUND(((AB140*14)*0.95),0)","v":7382},7603,7831,null,null,{"$f":"ROUND(((AB140*42)*0.97),0)","v":22611},31052,39979,null,null,555,570,585,null,null,{"$f":"C140+AK$1","v":920},null,null,null,null,30802]
[8400,25,null,null,null,null,null,null,null,null,null,null,123,127,131,null,null,1440,1483,1527,null,null,4228,5806,7475,null,null,580,595,610]
[8400,40,null,null,null,null,null,null,null,null,null,null,190,196,202,null,null,2239,2306,2375,null,null,6575,9030,11626,null,null,580,595,610]
[8400,60,null,null,null,null,null,null,null,null,null,null,280,288,297,null,null,3287,3386,3488,null,null,9654,13258,17070,null,null,580,595,610]
[8400,80,null,null,null,null,null,null,null,null,null,null,375,386,398,null,null,4407,4539,4675,null,null,12942,17774,22884,null,null,580,595,610]
[8400,100,null,null,null,null,null,null,null,null,null,null,470,484,499,null,null,5526,5692,5863,null,null,16230,22289,28697,null,null,580,595,610]
[8400,125,null,null,null,null,null,null,null,null,null,null,565,582,599,null,null,{"$f":"ROUND(((AB146*12)*0.95),0)","v":6612},6810,7014,null,null,{"$f":"ROUND(((AB146*36)*0.97),0)","v":20254},27815,35812,null,null,580,595,610]
[8400,150,null,null,null,null,null,null,null,null,null,null,655,675,695,null,null,{"$f":"ROUND(((AB147*14)*0.95),0)","v":7714},7945,8183,null,null,{"$f":"ROUND(((AB147*42)*0.97),0)","v":23629},32450,41779,null,null,580,595,610]
[8410,25,null,null,null,null,null,null,null,null,null,null,123,127,131,null,null,1440,1483,1527,null,null,4228,5806,7475,null,null,580,595,610]
[8410,40,null,null,null,null,null,null,null,null,null,null,190,196,202,null,null,2239,{"$f":"ROUND(R149*1.03,0)","v":2306},2375,null,null,6575,{"$f":"ROUND((W149/3)*1.03*4,0)","v":9030},{"$f":"ROUND((X149/4)*1.03*5,0)","v":11626},null,null,580,595,610]
[8410,60,null,null,null,null,null,null,null,null,null,null,280,288,297,null,null,3287,3386,3488,null,null,9654,13258,17070,null,null,580,595,610]
[8410,80,null,null,null,null,null,null,null,null,null,null,375,386,398,null,null,4407,4539,4675,null,null,12942,17774,22884,null,null,580,595,610]
[8410,100,null,null,null,null,null,null,null,null,null,null,470,484,499,null,null,5526,5692,5863,null,null,16230,22289,28697,null,null,580,595,610]
[8410,125,null,null,null,null,null,null,null,null,null,null,565,582,599,null,null,{"$f":"ROUND(((AB153*12)*0.95),0)","v":6612},6810,7014,null,null,{"$f":"ROUND(((AB153*36)*0.97),0)","v":20254},27815,35812,null,null,580,595,610]
[8410,150,null,null,null,null,null,null,null,null,null,null,655,675,695,null,null,{"$f":"ROUND(((AB154*14)*0.95),0)","v":7714},7945,8183,null,null,{"$f":"ROUND(((AB154*42)*0.97),0)","v":23629},32450,41779,null,null,580,595,610]
["M17",25,155,170,180,null,null,{"$f":"ROUND(((C155*36)*0.93),0)","v":5189},{"$f":"ROUND(((D155*48)*0.93),0)","v":7589},{"$f":"ROUND(((E155*60)*0.93),0)","v":10044},null,null,117,121,125,null,null,1371,1412,1454,null,null,4027,5530,7120,null,null,555,570,585,null,null,{"$f":"C155+AJ$1","v":215},{"$f":"D155+AJ$1","v":230},{"$f":"E155+AJ$1","v":240},null,null,{"$f":"ROUND(((AG155*36)*0.93),0)","v":7198},{"$f":"ROUND(((AH155*48)*0.93),0)","v":10267},{"$f":"ROUND(((AI155*60)*0.93),0)","v":13392}]
["M17",40,240,265,275,null,null,8035,11830,{"$f":"ROUND(((E156*60)*0.93),0)","v":15345},null,null,180,185,191,null,null,2112,2175,2240,null,null,6202,8517,10966,null,null,555,570,585,null,null,{"$f":"C156+AJ$1","v":300},{"$f":"D156+AJ$1","v":325},{"$f":"E156+AJ$1","v":335},null,null,10044,14508,{"$f":"ROUND(((AI156*60)*0.93),0)","v":18693}]
["M17",60,365,400,420,null,null,12220,17856,{"$f":"ROUND(((E157*60)*0.93),0)","v":23436},null,null,279,287,296,null,null,3280,3378,3479,null,null,9633,13229,17032,null,null,555,570,585,null,null,{"$f":"C157+AJ$1","v":425},{"$f":"D157+AJ$1","v":460},{"$f":"E157+AJ$1","v":480},null,null,14229,20534,{"$f":"ROUND(((AI157*60)*0.93),0)","v":26784}]
["M17",80,495,545,570,null,null,16573,24329,{"$f":"ROUND(((E158*60)*0.93),0)","v":31806},null,null,360,371,382,null,null,4237,4364,4495,null,null,12442,17087,22000,null,null,555,570,585,null,null,{"$f":"C158+AK$1","v":615},{"$f":"D158+AK$1","v":665},{"$f":"E158+AK$1","v":690},null,null,20590,29686,{"$f":"ROUND(((AI158*60)*0.93),0)","v":38502}]
["M17",100,605,665,695,null,null,20255,29686,{"$f":"ROUND(((E159*60)*0.93),0)","v":38781},null,null,450,{"$f":"ROUND(M159*1.03,0)","v":464},{"$f":"ROUND(N159*1.03,0)","v":478},null,null,5286,5445,5608,null,null,15524,21320,27450,null,null,555,570,585,null,null,{"$f":"C159+AK$1","v":725},{"$f":"D159+AK$1","v":785},{"$f":"E159+AK$1","v":815},null,null,24273,35042,{"$f":"ROUND(((AI159*60)*0.93),0)","v":45477}]
["M17",125,700,770,null,null,null,23436,34373,null,null,null,540,556,573,null,null,{"$f":"ROUND(((AB160*12)*0.95),0)","v":6327},6517,6713,null,null,{"$f":"ROUND(((AB160*36)*0.97),0)","v":19381},26617,34269,null,null,555,570,585,null,null,{"$f":"C160+AK$1","v":820},{"$f":"D160+AK$1","v":890},null,null,null,27454,39730]
["M17",150,800,null,null,null,null,26784,null,null,null,null,630,649,668,null,null,{"$f":"ROUND(((AB161*14)*0.95),0)","v":7382},7603,7831,null,null,{"$f":"ROUND(((AB161*42)*0.97),0)","v":22611},31052,39979,null,null,555,570,585,null,null,{"$f":"C161+AK$1","v":920},null,null,null,null,30802]
["M20",25,200,220,230,null,null,6696,{"$f":"ROUND(((D162*48)*0.93),0)","v":9821},{"$f":"ROUND(((E162*60)*0.93),0)","v":12834},null,null,117,121,125,null,null,1371,1412,1454,null,null,4027,5530,7120,null,null,555,570,585,null,null,{"$f":"C162+AJ$1","v":260},{"$f":"D162+AJ$1","v":280},{"$f":"E162+AJ$1","v":290},null,null,{"$f":"ROUND(((AG162*36)*0.93),0)","v":8705},{"$f":"ROUND(((AH162*48)*0.93),0)","v":12499},{"$f":"ROUND(((AI162*60)*0.93),0)","v":16182}]
["M20",40,310,340,355,null,null,10379,15178,{"$f":"ROUND(((E163*60)*0.93),0)","v":19809},null,null,180,185,191,null,null,2112,2175,2240,null,null,6202,8517,10966,null,null,555,570,585,null,null,{"$f":"C163+AJ$1","v":370},{"$f":"D163+AJ$1","v":400},{"$f":"E163+AJ$1","v":415},null,null,12388,17856,{"$f":"ROUND(((AI163*60)*0.93),0)","v":23157}]
["M20",60,475,525,545,null,null,15903,23436,{"$f":"ROUND(((E164*60)*0.93),0)","v":30411},null,null,279,287,296,null,null,3280,3378,3479,null,null,9633,13229,17032,null,null,555,570,585,null,null,{"$f":"C164+AJ$1","v":535},{"$f":"D164+AJ$1","v":585},{"$f":"E164+AJ$1","v":605},null,null,17912,26114,{"$f":"ROUND(((AI164*60)*0.93),0)","v":33759}]
["M20",80,640,705,735,null,null,21427,31471,{"$f":"ROUND(((E165*60)*0.93),0)","v":41013},null,null,360,{"$f":"ROUND(M165*1.03,0)","v":371},382,null,null,4237,4364,4495,null,null,12442,17087,22000,null,null,555,570,585,null,null,{"$f":"C165+AK$1","v":760},{"$f":"D165+AK$1","v":825},{"$f":"E165+AK$1","v":855},null,null,25445,36828,{"$f":"ROUND(((AI165*60)*0.93),0)","v":47709}]
["M20",100,775,855,890,null,null,25947,38167,{"$f":"ROUND(((E166*60)*0.93),0)","v":49662},null,null,450,464,478,null,null,5286,5445,5608,null,null,15524,21320,27450,null,null,555,570,585,null,null,{"$f":"C166+AK$1","v":895},{"$f":"D166+AK$1","v":975},{"$f":"E166+AK$1","v":1010},null,null,29965,43524,{"$f":"ROUND(((AI166*60)*0.93),0)","v":56358}]
["M20",125,875,965,null,null,null,29295,43078,null,null,null,540,556,573,null,null,{"$f":"ROUND(((AB167*12)*0.95),0)","v":6327},6517,6713,null,null,{"$f":"ROUND(((AB167*36)*0.97),0)","v":19381},26617,34269,null,null,555,570,585,null,null,{"$f":"C167+AK$1","v":995},{"$f":"D167+AK$1","v":1085},null,null,null,33313,48434]
["M20",150,975,null,null,null,null,32643,null,null,null,null,630,649,668,null,null,{"$f":"ROUND(((AB168*14)*0.95),0)","v":7382},7603,7831,null,null,{"$f":"ROUND(((AB168*42)*0.97),0)","v":22611},31052,39979,null,null,555,570,585,null,null,{"$f":"C168+AK$1","v":1095},null,null,null,null,36661]
["T20",25,190,210,220,null,null,6361,{"$f":"ROUND(((D169*48)*0.93),0)","v":9374},{"$f":"ROUND(((E169*60)*0.93),0)","v":12276},null,null,120,124,128,null,null,1405,1447,1490,null,null,4127,5668,7298,null,null,570,585,600,null,null,{"$f":"C169+AJ$1","v":250},{"$f":"D169+AJ$1","v":270},{"$f":"E169+AJ$1","v":280},null,null,8370,12053,{"$f":"ROUND(((AI169*60)*0.93),0)","v":15624}]
["T20",40,295,325,340,null,null,9877,14508,{"$f":"ROUND(((E170*60)*0.93),0)","v":18972},null,null,185,191,197,null,null,2179,2244,2311,null,null,6399,8788,11315,null,null,570,585,600,null,null,{"$f":"C170+AJ$1","v":355},{"$f":"D170+AJ$1","v":385},{"$f":"E170+AJ$1","v":400},null,null,11885,17186,{"$f":"ROUND(((AI170*60)*0.93),0)","v":22320}]
["T20",60,455,500,525,null,null,15233,22320,{"$f":"ROUND(((E171*60)*0.93),0)","v":29295},null,null,275,283,291,null,null,3233,3330,3430,null,null,9494,13038,16786,null,null,570,585,600,null,null,{"$f":"C171+AJ$1","v":515},{"$f":"D171+AJ$1","v":560},{"$f":"E171+AJ$1","v":585},null,null,17242,24998,{"$f":"ROUND(((AI171*60)*0.93),0)","v":32643}]
["T20",80,610,670,700,null,null,20423,29909,{"$f":"ROUND(((E172*60)*0.93),0)","v":39060},null,null,370,381,392,null,null,4345,4475,4609,null,null,12761,17525,22563,null,null,570,585,600,null,null,{"$f":"C172+AK$1","v":730},{"$f":"D172+AK$1","v":790},{"$f":"E172+AK$1","v":820},null,null,24440,35266,{"$f":"ROUND(((AI172*60)*0.93),0)","v":45756}]
["T20",100,745,820,855,null,null,24943,36605,{"$f":"ROUND(((E173*60)*0.93),0)","v":47709},null,null,460,474,488,null,null,5412,5574,5741,null,null,15893,21826,28101,null,null,570,585,600,null,null,{"$f":"C173+AK$1","v":865},{"$f":"D173+AK$1","v":940},{"$f":"E173+AK$1","v":975},null,null,28960,41962,{"$f":"ROUND(((AI173*60)*0.93),0)","v":54405}]
["T20",125,845,930,null,null,null,28291,41515,null,null,null,555,572,589,null,null,{"$f":"ROUND(((AB174*12)*0.95),0)","v":6498},6693,6894,null,null,{"$f":"ROUND(((AB174*36)*0.97),0)","v":19904},27335,35194,null,null,570,585,600,null,null,{"$f":"C174+AK$1","v":965},{"$f":"D174+AK$1","v":1050},null,null,null,32308,46872]
["T20",150,945,null,null,null,null,31639,null,null,null,null,645,664,684,null,null,{"$f":"ROUND(((AB175*14)*0.95),0)","v":7581},7808,8042,null,null,{"$f":"ROUND(((AB175*42)*0.97),0)","v":23222},31892,41061,null,null,570,585,600,null,null,{"$f":"C175+AK$1","v":1065},null,null,null,null,35656]
["T20_Direct_Discount",25,190,210,220,null,null,{"$f":"ROUND(((C176*36)*0.93),0)","v":6361},{"$f":"ROUND(((D176*48)*0.93),0)","v":9374},{"$f":"ROUND(((E176*60)*0.93),0)","v":12276},null,null,120,124,128,null,null,1405,1447,1490,null,null,4127,5668,7298,null,null,570,585,600,null,null,{"$f":"C176+AJ$1","v":250},{"$f":"D176+AJ$1","v":270},{"$f":"E176+AJ$1","v":280},null,null,8370,12053,{"$f":"ROUND(((AI176*60)*0.93),0)","v":15624}]
["T20_Direct_Discount",40,295,325,340,null,null,9877,14508,18972,null,null,185,191,197,null,null,2179,2244,2311,null,null,6399,8788,11315,null,null,570,585,600,null,null,{"$f":"C177+AJ$1","v":355},{"$f":"D177+AJ$1","v":385},{"$f":"E177+AJ$1","v":400},null,null,11885,17186,{"$f":"ROUND(((AI177*60)*0.93),0)","v":22320}]
["T20_Direct_Discount",60,455,500,525,null,null,15233,22320,29295,null,null,275,283,291,null,null,3233,3330,3430,null,null,9494,13038,16786,null,null,570,585,600,null,null,{"$f":"C178+AJ$1","v":515},{"$f":"D178+AJ$1","v":560},{"$f":"E178+AJ$1","v":585},null,null,17242,24998,{"$f":"ROUND(((AI178*60)*0.93),0)","v":32643}]
["T20_Direct_Discount",80,610,670,700,null,null,20423,29909,39060,null,null,370,381,392,null,null,4345,4475,4609,null,null,12761,17525,22563,null,null,570,585,600,null,null,{"$f":"C179+AK$1","v":730},{"$f":"D179+AK$1","v":790},{"$f":"E179+AK$1","v":820},null,null,24440,35266,{"$f":"ROUND(((AI179*60)*0.93),0)","v":45756}]
["T20_Direct_Discount",100,745,820,855,null,null,24943,36605,47709,null,null,460,474,488,null,null,5412,5574,5741,null,null,15893,21826,28101,null,null,570,585,600,null,null,{"$f":"C180+AK$1","v":865},{"$f":"D180+AK$1","v":940},{"$f":"E180+AK$1","v":975},null,null,28960,41962,{"$f":"ROUND(((AI180*60)*0.93),0)","v":54405}]
["T20_Direct_Discount",125,845,930,null,null,null,28291,41515,null,null,null,555,572,589,null,null,{"$f":"ROUND(((AB181*12)*0.95),0)","v":6498},6693,6894,null,null,{"$f":"ROUND(((AB181*36)*0.97),0)","v":19904},27335,35194,null,null,570,585,600,null,null,{"$f":"C181+AK$1","v":965},{"$f":"D181+AK$1","v":1050},null,null,null,32308,46872]
["T20_Direct_Discount",150,945,null,null,null,null,31639,null,null,null,null,645,664,684,null,null,{"$f":"ROUND(((AB182*14)*0.95),0)","v":7581},7808,8042,null,null,{"$f":"ROUND(((AB182*42)*0.97),0)","v":23222},31892,41061,null,null,570,585,600,null,null,{"$f":"C182+AK$1","v":1065},null,null,null,null,35656]
["M30",25,200,220,230,null,null,6696,9821,12834,null,null,117,121,125,null,null,1371,1412,1454,null,null,4027,5530,7120,null,null,555,570,585,null,null,{"$f":"C183+AJ$1","v":260},{"$f":"D183+AJ$1","v":280},{"$f":"E183+AJ$1","v":290},null,null,8705,12499,{"$f":"ROUND(((AI183*60)*0.93),0)","v":16182}]
["M30",40,310,340,355,null,null,10379,15178,19809,null,null,180,185,191,null,null,2112,2175,2240,null,null,6202,8517,10966,null,null,555,570,585,null,null,{"$f":"C184+AJ$1","v":370},{"$f":"D184+AJ$1","v":400},{"$f":"E184+AJ$1","v":415},null,null,12388,17856,{"$f":"ROUND(((AI184*60)*0.93),0)","v":23157}]
["M30",60,475,525,545,null,null,15903,23436,30411,null,null,279,{"$f":"ROUND(M185*1.03,0)","v":287},296,null,null,3280,3378,3479,null,null,9633,13229,17032,null,null,555,570,585,null,null,{"$f":"C185+AJ$1","v":535},{"$f":"D185+AJ$1","v":585},{"$f":"E185+AJ$1","v":605},null,null,17912,26114,{"$f":"ROUND(((AI185*60)*0.93),0)","v":33759}]
["M30",80,640,705,735,null,null,21427,31471,41013,null,null,360,371,382,null,null,4237,4364,4495,null,null,12442,17087,22000,null,null,555,570,585,null,null,{"$f":"C186+AK$1","v":760},{"$f":"D186+AK$1","v":825},{"$f":"E186+AK$1","v":855},null,null,25445,36828,{"$f":"ROUND(((AI186*60)*0.93),0)","v":47709}]
["M30",100,775,855,890,null,null,25947,38167,49662,null,null,450,464,478,null,null,5286,5445,5608,null,null,15524,21320,27450,null,null,555,570,585,null,null,{"$f":"C187+AK$1","v":895},{"$f":"D187+AK$1","v":975},{"$f":"E187+AK$1","v":1010},null,null,29965,43524,{"$f":"ROUND(((AI187*60)*0.93),0)","v":56358}]
["M30",125,875,965,null,null,null,29295,43078,null,null,null,540,556,573,null,null,{"$f":"ROUND(((AB188*12)*0.95),0)","v":6327},6517,6713,null,null,{"$f":"ROUND(((AB188*36)*0.97),0)","v":19381},26617,34269,null,null,555,570,585,null,null,{"$f":"C188+AK$1","v":995},{"$f":"D188+AK$1","v":1085},null,null,null,33313,48434]
["M30",150,975,null,null,null,null,32643,null,null,null,null,630,649,668,null,null,{"$f":"ROUND(((AB189*14)*0.95),0)","v":7382},7603,7831,null,null,{"$f":"ROUND(((AB189*42)*0.97),0)","v":22611},31052,39979,null,null,555,570,585,null,null,{"$f":"C189+AK$1","v":1095},null,null,null,null,36661]
[550,25,null,null,null,null,null,null,null,null,null,null,124,128,132,null,null,1451,1495,1540,null,null,4262,5853,7536,null,null,585,605,620]
[550,40,null,null,null,null,null,null,null,null,null,null,190,196,202,null,null,2234,2301,2370,null,null,6559,9008,11598,null,null,585,605,620]
[550,60,null,null,null,null,null,null,null,null,null,null,284,293,302,null,null,3339,3439,3542,null,null,9804,13464,17335,null,null,585,605,620]
[550,80,null,null,null,null,null,null,null,null,null,null,380,391,403,null,null,4467,4601,4739,null,null,13118,18015,23194,null,null,585,605,620]
[550,100,null,null,null,null,null,null,null,null,null,null,475,489,504,null,null,5584,5752,5925,null,null,16398,22520,28995,null,null,585,605,620]
[550,125,null,null,null,null,null,null,null,null,null,null,565,582,599,null,null,{"$f":"ROUND(((AB195*12)*0.95),0)","v":6669},6869,7075,null,null,{"$f":"ROUND(((AB195*36)*0.97),0)","v":20428},28054,36120,null,null,585,605,620]
[550,150,null,null,null,null,null,null,null,null,null,null,665,685,706,null,null,{"$f":"ROUND(((AB196*14)*0.95),0)","v":7781},8014,8254,null,null,{"$f":"ROUND(((AB196*42)*0.97),0)","v":23833},32731,42141,null,null,585,605,620]
[1550,25,null,null,null,null,null,null,null,null,null,null,124,128,132,null,null,1451,1495,1540,null,null,4262,5853,7536,null,null,585,605,620]
[1550,40,null,null,null,null,null,null,null,null,null,null,190,196,202,null,null,2234,2301,2370,null,null,6559,9008,11598,null,null,585,605,620]
[1550,60,null,null,null,null,null,null,null,null,null,null,284,293,302,null,null,3339,3439,3542,null,null,9804,13464,17335,null,null,585,605,620]
[1550,80,null,null,null,null,null,null,null,null,null,null,380,391,403,null,null,4467,4601,4739,null,null,13118,18015,23194,null,null,585,605,620]
[1550,100,null,null,null,null,null,null,null,null,null,null,475,489,504,null,null,5584,5752,5925,null,null,16398,22520,28995,null,null,585,605,620]
[1550,125,null,null,null,null,null,null,null,null,null,null,565,582,599,null,null,{"$f":"ROUND(((AB202*12)*0.95),0)","v":6669},6869,7075,null,null,{"$f":"ROUND(((AB202*36)*0.97),0)","v":20428},28054,36120,null,null,585,605,620]
[1550,150,null,null,null,null,null,null,null,null,null,null,665,685,706,null,null,{"$f":"ROUND(((AB203*14)*0.95),0)","v":7781},8014,8254,null,null,{"$f":"ROUND(((AB203*42)*0.97),0)","v":23833},32731,42141,null,null,585,605,620]
["510E",25,null,null,null,null,null,null,null,null,null,null,109,112,115,null,null,1280,1318,1358,null,null,3760,5164,6649,null,null,515,530,545]
["510E",40,null,null,null,null,null,null,null,null,null,null,165,{"$f":"ROUND(M205*1.03,0)","v":170},175,null,null,1942,2000,2060,null,null,5706,7836,10089,null,null,515,530,545]
["510E",60,null,null,null,null,null,null,null,null,null,null,250,258,266,null,null,2944,3032,3123,null,null,8646,11874,15288,null,null,515,530,545]
["510E",80,null,null,null,null,null,null,null,null,null,null,335,345,355,null,null,3932,4050,4172,null,null,11549,15861,20421,null,null,515,530,545]
["510E",100,null,null,null,null,null,null,null,null,null,null,415,427,440,null,null,4874,5020,5171,null,null,14315,19659,25311,null,null,515,530,545]
["510E",125,null,null,null,null,null,null,null,null,null,null,500,515,530,null,null,{"$f":"ROUND(((AB209*12)*0.95),0)","v":5871},6047,6228,null,null,{"$f":"ROUND(((AB209*36)*0.97),0)","v":17984},24698,31799,null,null,515,530,545]
["510E",150,null,null,null,null,null,null,null,null,null,null,585,603,621,null,null,{"$f":"ROUND(((AB210*14)*0.95),0)","v":6850},7056,7268,null,null,{"$f":"ROUND(((AB210*42)*0.97),0)","v":20981},28814,37098,null,null,515,530,545]
[7200,25,null,null,null,null,null,null,null,null,null,null,93,96,99,null,null,1097,1130,1164,null,null,3223,4426,5698,null,null,445,460,475]
[7200,40,null,null,null,null,null,null,null,null,null,null,145,149,153,null,null,1699,1750,1803,null,null,4989,6852,8822,null,null,445,460,475]
[7200,60,null,null,null,null,null,null,null,null,null,null,215,221,228,null,null,2525,2601,2679,null,null,7416,10185,13113,null,null,445,460,475]
[7200,80,null,null,null,null,null,null,null,null,null,null,290,299,308,null,null,3410,3512,3617,null,null,10015,13754,17708,null,null,445,460,475]
[7200,100,null,null,null,null,null,null,null,null,null,null,360,371,382,null,null,4237,4364,4495,null,null,12442,17087,22000,null,null,445,460,475]
[7200,125,null,null,null,null,null,null,null,null,null,null,430,443,456,null,null,{"$f":"ROUND(((AB216*12)*0.95),0)","v":5073},5225,5382,null,null,{"$f":"ROUND(((AB216*36)*0.97),0)","v":15539},21340,27475,null,null,445,460,475]
[7200,150,null,null,null,null,null,null,null,null,null,null,505,520,536,null,null,{"$f":"ROUND(((AB217*14)*0.95),0)","v":5919},6097,6280,null,null,{"$f":"ROUND(((AB217*42)*0.97),0)","v":18129},24897,32055,null,null,445,460,475]
[5100,25,null,null,null,null,null,null,null,null,null,null,50,52,54,null,null,592,610,628,null,null,1737,2385,3071,null,null,310,320,330]
[5100,40,null,null,null,null,null,null,null,null,null,null,79,81,83,null,null,927,955,984,null,null,2723,3740,4815,null,null,310,320,330]
[5100,60,null,null,null,null,null,null,null,null,null,null,118,122,126,null,null,1391,{"$f":"ROUND(R220*1.03,0)","v":1433},1476,null,null,4085,{"$f":"ROUND((W220/3)*1.03*4,0)","v":5610},{"$f":"ROUND((X220/4)*1.03*5,0)","v":7223},null,null,310,320,330]
[5100,80,null,null,null,null,null,null,null,null,null,null,158,163,168,null,null,1854,1910,1967,null,null,5446,7479,9629,null,null,310,320,330]
[5100,100,null,null,null,null,null,null,null,null,null,null,200,206,212,null,null,{"$f":"ROUND((AB222*8)*0.95,0)","v":2356},2427,2500,null,null,{"$f":"ROUND(((AB222*24)*0.93),0)","v":6919},9502,12234,null,null,310,320,330]
[5200,25,null,null,null,null,null,null,null,null,null,null,50,52,54,null,null,592,610,628,null,null,1737,2385,3071,null,null,310,320,330]
[5200,40,null,null,null,null,null,null,null,null,null,null,79,81,83,null,null,927,955,984,null,null,2723,3740,4815,null,null,310,320,330]
[5200,60,null,null,null,null,null,null,null,null,null,null,118,{"$f":"ROUND(M225*1.03,0)","v":122},126,null,null,1391,1433,1476,null,null,4085,5610,7223,null,null,310,320,330]
[5200,80,null,null,null,null,null,null,null,null,null,null,158,163,168,null,null,1854,1910,1967,null,null,5446,7479,9629,null,null,310,320,330]
[5200,100,null,null,null,null,null,null,null,null,null,null,200,206,212,null,null,{"$f":"ROUND((AB227*8)*0.95,0)","v":2356},2427,2500,null,null,{"$f":"ROUND(((AB227*24)*0.93),0)","v":6919},9502,12234,null,null,310,320,330]
[5280,25,null,null,null,null,null,null,null,null,null,null,50,52,54,null,null,592,610,628,null,null,1737,2385,3071,null,null,310,320,330]
[5280,40,null,null,null,null,null,null,null,null,null,null,79,81,83,null,null,927,955,984,null,null,2723,3740,4815,null,null,310,320,330]
[5280,60,null,null,null,null,null,null,null,null,null,null,118,122,126,null,null,1391,1433,1476,null,null,4085,5610,7223,null,null,310,320,330]
[5280,80,null,null,null,null,null,null,null,null,null,null,158,163,168,null,null,1854,1910,1967,null,null,5446,7479,9629,null,null,310,320,330]
[5280,100,null,null,null,null,null,null,null,null,null,null,200,206,212,null,null,{"$f":"ROUND((AB232*8)*0.95,0)","v":2356},2427,2500,null,null,{"$f":"ROUND(((AB232*24)*0.93),0)","v":6919},9502,12234,null,null,310,320,330]
[5300,25,null,null,null,null,null,null,null,null,null,null,50,52,54,null,null,592,610,628,null,null,1737,2385,3071,null,null,310,320,330]
[5300,40,null,null,null,null,null,null,null,null,null,null,79,81,83,null,null,927,955,984,null,null,2723,3740,4815,null,null,310,320,330]
[5300,60,null,null,null,null,null,null,null,null,null,null,118,122,126,null,null,1391,1433,1476,null,null,4085,5610,7223,null,null,310,320,330]
[5300,80,null,null,null,null,null,null,null,null,null,null,158,163,168,null,null,1854,1910,1967,null,null,5446,7479,9629,null,null,310,320,330]
[5300,100,null,null,null,null,null,null,null,null,null,null,200,206,212,null,null,{"$f":"ROUND((AB237*8)*0.95,0)","v":2356},2427,2500,null,null,{"$f":"ROUND(((AB237*24)*0.93),0)","v":6919},9502,12234,null,null,310,320,330]
[5400,25,null,null,null,null,null,null,null,null,null,null,50,52,54,null,null,592,610,628,null,null,1737,2385,3071,null,null,310,320,330]
[5400,40,null,null,null,null,null,null,null,null,null,null,79,81,83,null,null,927,955,984,null,null,2723,3740,4815,null,null,310,320,330]
[5400,60,null,null,null,null,null,null,null,null,null,null,118,122,126,null,null,1391,1433,1476,null,null,4085,5610,7223,null,null,310,320,330]
[5400,80,null,null,null,null,null,null,null,null,null,null,158,163,168,null,null,1854,1910,1967,null,null,5446,7479,9629,null,null,310,320,330]
[5400,100,null,null,null,null,null,null,null,null,null,null,200,206,212,null,null,{"$f":"ROUND((AB242*8)*0.95,0)","v":2356},2427,2500,null,null,{"$f":"ROUND(((AB242*24)*0.93),0)","v":6919},9502,12234,null,null,310,320,330]
[5500,25,null,null,null,null,null,null,null,null,null,null,50,52,54,null,null,592,610,628,null,null,1737,2385,3071,null,null,310,320,330]
[5500,40,null,null,null,null,null,null,null,null,null,null,79,81,83,null,null,927,955,984,null,null,2723,3740,4815,null,null,310,320,330]
[5500,60,null,null,null,null,null,null,null,null,null,null,118,{"$f":"ROUND(M245*1.03,0)","v":122},126,null,null,1391,1433,1476,null,null,4085,5610,7223,null,null,310,320,330]
[5500,80,null,null,null,null,null,null,null,null,null,null,158,163,168,null,null,1854,1910,1967,null,null,5446,7479,9629,null,null,310,320,330]
[5500,100,null,null,null,null,null,null,null,null,null,null,200,206,212,null,null,{"$f":"ROUND((AB247*8)*0.95,0)","v":2356},2427,2500,null,null,{"$f":"ROUND(((AB247*24)*0.93),0)","v":6919},9502,12234,null,null,310,320,330]
[5520,25,null,null,null,null,null,null,null,null,null,null,50,52,54,null,null,592,610,628,null,null,1737,2385,3071,null,null,310,320,330]
[5520,40,null,null,null,null,null,null,null,null,null,null,79,81,83,null,null,927,955,984,null,null,2723,3740,4815,null,null,310,320,330]
[5520,60,null,null,null,null,null,null,null,null,null,null,118,122,126,null,null,1391,1433,1476,null,null,4085,5610,7223,null,null,310,320,330]
[5520,80,null,null,null,null,null,null,null,null,null,null,158,163,168,null,null,1854,1910,1967,null,null,5446,7479,9629,null,null,310,320,330]
[5520,100,null,null,null,null,null,null,null,null,null,null,200,206,212,null,null,{"$f":"ROUND((AB252*8)*0.95,0)","v":2356},2427,2500,null,null,{"$f":"ROUND(((AB252*24)*0.93),0)","v":6919},9502,12234,null,null,310,320,330]
[5540,25,null,null,null,null,null,null,null,null,null,null,50,52,54,null,null,592,610,628,null,null,1737,2385,3071,null,null,310,320,330]
[5540,40,null,null,null,null,null,null,null,null,null,null,79,81,83,null,null,927,955,984,null,null,2723,3740,4815,null,null,310,320,330]
[5540,60,null,null,null,null,null,null,null,null,null,null,118,122,126,null,null,1391,1433,1476,null,null,4085,5610,7223,null,null,310,320,330]
[5540,80,null,null,null,null,null,null,null,null,null,null,158,163,168,null,null,1854,1910,1967,null,null,5446,7479,9629,null,null,310,320,330]
[5540,100,null,null,null,null,null,null,null,null,null,null,200,206,212,null,null,{"$f":"ROUND((AB257*8)*0.95,0)","v":2356},2427,2500,null,null,{"$f":"ROUND(((AB257*24)*0.93),0)","v":6919},9502,12234,null,null,310,320,330]
[5560,25,null,null,null,null,null,null,null,null,null,null,50,52,54,null,null,592,610,628,null,null,1737,2385,3071,null,null,310,320,330]
[5560,40,null,null,null,null,null,null,null,null,null,null,79,81,83,null,null,927,955,984,null,null,2723,3740,4815,null,null,310,320,330]
[5560,60,null,null,null,null,null,null,null,null,null,null,118,122,126,null,null,1391,1433,1476,null,null,4085,5610,7223,null,null,310,320,330]
[5560,80,null,null,null,null,null,null,null,null,null,null,158,163,168,null,null,1854,1910,1967,null,null,5446,7479,9629,null,null,310,320,330]
[5560,100,null,null,null,null,null,null,null,null,null,null,200,206,212,null,null,{"$f":"ROUND((AB262*8)*0.95,0)","v":2356},2427,2500,null,null,{"$f":"ROUND(((AB262*24)*0.93),0)","v":6919},9502,12234,null,null,310,320,330]
["Orbio 5000-Sc",1,34,null,null,null,null,{"$f":"ROUND(((C263*36)*0.93),0)","v":1138},{"$f":"ROUND(((D263*48)*0.93),0)","v":0},{"$f":"ROUND(((E263*60)*0.93),0)","v":0},null,null,32,33,34,null,null,361,null,null,null,null,1059,null,null,null,null,null,null,null,null,null,34,null,null,null,null,34]
["Orbio 5000-Sc",2,58,null,null,null,null,1942,0,0,null,null,32,33,34,null,null,361,null,null,null,null,1059,null,null,null,null,null,null,null,null,null,58,null,null,null,null,58]
["Orbio 5000-Sc",3,137,null,null,null,null,4587,0,0,null,null,63,{"$f":"ROUND(M265*1.03,0)","v":65},67,null,null,721,null,null,null,null,2118,null,null,null,null,null,null,null,null,null,137,null,null,null,null,137]
["Orbio 5000-Sc",4,230,null,null,null,null,7700,0,0,null,null,95,98,101,null,null,1082,null,null,null,null,3178,null,null,null,null,null,null,null,null,null,230,null,null,null,null,230]
["Orbio 5000-Sc",5,323,null,null,null,null,10814,0,0,null,null,127,131,135,null,null,1443,null,null,null,null,4237,null,null,null,null,null,null,null,null,null,323,null,null,null,null,323]
["Orbio 5000-Sc",6,426,null,null,null,null,14262,0,0,null,null,158,163,168,null,null,1803,null,null,null,null,5296,null,null,null,null,null,null,null,null,null,426,null,null,null,null,426]
[null,null,null,null,null,null,null,null,null,null,null,null,null,null,null,null,null,null,null,null,null,null,null,null,null,null,null,null,null,null,null,null,323,null,null,null,null,323]
[null,null,null,null,null,null,null,null,null,null,null,null,null,null,null,null,null,null,null,null,null,null,null,null,null,null,null,null,null,null,null,null,426,null,null,null,null,426]

{"sheet":"County Tier","index":22,"n_rows":640,"n_cols":6,"rows_kept":640,"cut":false,"hidden":true,"merged":[]}
["State","Code","County","PM","Reg","Trip"]
["Alberta",null,"ALL OTHER COUNTIES",96,124,103]
["Alabama","005","BARBOUR",85,112,92]
["Alabama","039","COVINGTON",85,112,92]
["Alabama","045","DALE",85,112,92]
["Alabama","053","ESCAMBIA",85,112,92]
["Alabama","061","GENEVA",85,112,92]
["Alabama","067","HENRY",85,112,92]
["Alabama","069","HOUSTON",85,112,92]
["Alabama","081","LEE",85,112,92]
["Alabama",113,"RUSSELL",85,112,92]
["Alabama",null,"ALL OTHER COUNTIES",82,107,90]
["Alaska",null,"ALL OTHER COUNTIES",96,117,101]
["Arizona",null,"ALL OTHER COUNTIES",93,115,96]
["Arkansas","005","BAXTER",84,108,92]
["Arkansas","007","BENTON",84,108,92]
["Arkansas","009","BOONE",84,108,92]
["Arkansas","015","CARROLL",84,108,92]
["Arkansas","021","CLAY",87,114,95]
["Arkansas","031","CRAIGHEAD",87,114,95]
["Arkansas","033","CRAWFORD",84,108,92]
["Arkansas","035","CRITTENDEN",87,114,95]
["Arkansas","037","CROSS",87,114,95]
["Arkansas","047","FRANKLIN",84,108,92]
["Arkansas","055","GREENE",87,114,95]
["Arkansas","071","JOHNSON",84,108,92]
["Arkansas","077","LEE",87,114,95]
["Arkansas","083","LOGAN",84,108,92]
["Arkansas","087","MADISON",84,108,92]
["Arkansas","089","MARION",84,108,92]
["Arkansas","093","MISSISSIPPI",87,114,95]
["Arkansas","097","MONTGOMERY",84,108,92]
["Arkansas","101","NEWTON",84,108,92]
["Arkansas",107,"PHILLIPS",87,114,95]
["Arkansas",111,"POINSETT",87,114,95]
["Arkansas","113","POLK",84,108,92]
["Arkansas","127","SCOTT",84,108,92]
["Arkansas","131","SEBASTIAN",84,108,92]
["Arkansas",123,"ST. FRANCIS",87,114,95]
["Arkansas","143","WASHINGTON",84,108,92]
["Arkansas",null,"ALL OTHER COUNTIES",82,107,90]
["British Columbia",null,"ALL OTHER COUNTIES",99,127,103]
["California","001","ALAMEDA",110,132,111]
["California","009","CALAVERAS",97,124,101]
["California","013","CONTRA COSTA",110,132,111]
["California","019","FRESNO",97,124,101]
["California","025","IMPERIAL",97,124,101]
["California","027","INYO",97,124,101]
["California","029","KERN",97,124,101]
["California","031","KINGS",97,124,101]
["California","037","LOS ANGELES",100,124,108]
["California","039","MADERA",97,124,101]
["California","041","MARIN",110,132,111]
["California","043","MARIPOSA",97,124,101]
["California","047","MERCED",97,124,101]
["California","051","MONO",97,124,101]
["California","053","MONTEREY",110,132,111]
["California","055","NAPA",110,132,111]
["California","059","ORANGE",100,124,108]
["California","065","RIVERSIDE",100,124,108]
["California","069","SAN BENITO",110,132,111]
["California","071","SAN BERNARDINO",100,124,108]
["California","073","SAN DIEGO",97,124,101]
["California","075","SAN FRANCISCO",110,132,111]
["California","077","SAN JOAQUIN",97,124,101]
["California","079","SAN LUIS OBISPO",100,124,108]
["California","081","SAN MATEO",110,132,111]
["California","083","SANTA BARBARA",100,124,108]
["California","085","SANTA CLARA",110,132,111]
["California","087","SANTA CRUZ",110,132,111]
["California","095","SOLANO",110,132,111]
["California","097","SONOMA",110,132,111]
["California","099","STANISLAUS",97,124,101]
["California",107,"TULARE",97,124,101]
["California",109,"TUOLUMNE",97,124,101]
["California",111,"VENTURA",100,124,108]
["California",null,"ALL OTHER COUNTIES",97,124,101]
["Colorado",null,"ALL OTHER COUNTIES",90,117,95]
["Connecticut",null,"ALL OTHER COUNTIES",99,127,103]
["Delaware","003","NEW CASTLE",99,127,103]
["Delaware",null,"ALL OTHER COUNTIES",82,107,90]
["District of Columbia",null,"ALL OTHER COUNTIES",99,124,102]
["Florida",null,"ALL OTHER COUNTIES",85,112,92]
["Georgia","009","BALDWIN",90,117,95]
["Georgia","011","BANKS",90,117,95]
["Georgia","013","BARROW",90,117,95]
["Georgia","015","BARTOW",90,117,95]
["Georgia","021","BIBB",90,117,95]
["Georgia","035","BUTTS",90,117,95]
["Georgia","045","CARROLL",90,117,95]
["Georgia","057","CHEROKEE",90,117,95]
["Georgia","059","CLARKE",90,117,95]
["Georgia","063","CLAYTON",90,117,95]
["Georgia","067","COBB",90,117,95]
["Georgia","077","COWETA",90,117,95]
["Georgia","079","CRAWFORD",90,117,95]
["Georgia","085","DAWSON",90,117,95]
["Georgia","089","DEKALB",90,117,95]
["Georgia","097","DOUGLAS",90,117,95]
["Georgia",113,"FAYETTE",90,117,95]
["Georgia",115,"FLOYD",90,117,95]
["Georgia",117,"FORSYTH",90,117,95]
["Georgia",121,"FULTON",90,117,95]
["Georgia",129,"GORDON",90,117,95]
["Georgia",135,"GWINNETT",90,117,95]
["Georgia",139,"HALL",90,117,95]
["Georgia",143,"HARALSON",90,117,95]
["Georgia",149,"HEARD",90,117,95]
["Georgia",151,"HENRY",90,117,95]
["Georgia",153,"HOUSTON",90,117,95]
["Georgia",157,"JACKSON",90,117,95]
["Georgia",159,"JASPER",90,117,95]
["Georgia",169,"JONES",90,117,95]
["Georgia",171,"LAMAR",90,117,95]
["Georgia",187,"LUMPKIN",90,117,95]
["Georgia",195,"Madison",90,117,95]
["Georgia",207,"MONROE",90,117,95]
["Georgia",211,"MORGAN",90,117,95]
["Georgia",217,"NEWTON",90,117,95]
["Georgia",219,"OCONEE",90,117,95]
["Georgia",223,"PAULDING",90,117,95]
["Georgia",225,"PEACH",90,117,95]
["Georgia",227,"PICKENS",90,117,95]
["Georgia",231,"PIKE",90,117,95]
["Georgia",233,"POLK",90,117,95]
["Georgia",237,"PUTNAM",90,117,95]
["Georgia",247,"ROCKDALE",90,117,95]
["Georgia",255,"SPALDING",90,117,95]
["Georgia",289,"TWIGGS",90,117,95]
["Georgia",293,"UPSON",90,117,95]
["Georgia",297,"WALTON",90,117,95]
["Georgia",null,"ALL OTHER COUNTIES",85,112,92]
["Hawaii",null,"ALL OTHER COUNTIES",110,132,111]
["Idaho",null,"ALL OTHER COUNTIES",78,103,85]
["Illinois","001","ADAMS",93,118,101]
["Illinois","003","ALEXANDER",93,118,101]
["Illinois","005","BOND",93,118,101]
["Illinois","007","BOONE",99,127,110]
["Illinois","013","CALHOUN",93,118,101]
["Illinois","025","CLAY",93,118,101]
["Illinois","027","CLINTON",93,118,101]
["Illinois","031","COOK",99,127,110]
["Illinois","037","DEKALB",99,127,110]
["Illinois","043","DU PAGE",99,127,110]
["Illinois","049","EFFINGHAM",93,118,101]
["Illinois","051","Fayette",93,118,101]
["Illinois","055","FRANKLIN",93,118,101]
["Illinois","061","GREENE",93,118,101]
["Illinois","063","GRUNDY",99,127,110]
["Illinois","077","JACKSON",93,118,101]
["Illinois","081","JEFFERSON",93,118,101]
["Illinois","083","JERSEY",93,118,101]
["Illinois","089","KANE",99,127,110]
["Illinois","091","KANKAKEE",99,127,110]
["Illinois","093","KENDALL",99,127,110]
["Illinois","097","LAKE",99,127,110]
["Illinois",117,"MACOUPIN",93,118,101]
["Illinois",119,"MADISON",93,118,101]
["Illinois",121,"MARION",93,118,101]
["Illinois",111,"MCHENRY",99,127,110]
["Illinois",133,"MONROE",93,118,101]
["Illinois",135,"MONTGOMERY",93,118,101]
["Illinois",141,"OGLE",99,127,110]
["Illinois",145,"PERRY",93,118,101]
["Illinois",149,"PIKE",93,118,101]
["Illinois",157,"RANDOLPH",93,118,101]
["Illinois",163,"SAINT CLAIR",93,118,101]
["Illinois",177,"STEPHENSON",99,127,110]
["Illinois",181,"UNION",93,118,101]
["Illinois",189,"WASHINGTON",93,118,101]
["Illinois",197,"WILL",99,127,110]
["Illinois",199,"WILLIAMSON",93,118,101]
["Illinois",201,"WINNEBAGO",99,127,110]
["Illinois",null,"ALL OTHER COUNTIES",85,112,92]
["Indiana","007","BENTON",99,127,110]
["Indiana","019","Clark",84,108,92]
["Indiana","025","Crawford",84,108,92]
["Indiana","037","Dubois",84,108,92]
["Indiana","043","Floyd",84,108,92]
["Indiana","051","Gibson",84,108,92]
["Indiana","061","Harrison",84,108,92]
["Indiana","073","JASPER",99,127,110]
["Indiana","077","Jefferson",84,108,92]
["Indiana","079","Jennings",84,108,92]
["Indiana","083","Knox",84,108,92]
["Indiana","091","LA PORTE",99,127,110]
["Indiana","089","LAKE",99,127,110]
["Indiana","093","Lawrence.",84,108,92]
["Indiana",111,"NEWTON",99,127,110]
["Indiana",115,"OHIO",84,108,92]
["Indiana",117,"Orange",84,108,92]
["Indiana",123,"Perry",84,108,92]
["Indiana",125,"Pike",84,108,92]
["Indiana",127,"PORTER",99,127,110]
["Indiana",129,"Posey",84,108,92]
["Indiana",131,"PULASKI",99,127,110]
["Indiana",147,"Spencer",84,108,92]
["Indiana",149,"STARKE",99,127,110]
["Indiana",155,"SWITZERLAND",84,108,92]
["Indiana",163,"Vanderburgh",84,108,92]
["Indiana",173,"Warrick",84,108,92]
["Indiana",175,"Washington",84,108,92]
["Indiana",177,"WAYNE",84,108,92]
["Indiana",null,"ALL OTHER COUNTIES",87,114,95]
["Iowa",null,"ALL OTHER COUNTIES",84,108,92]
["Kansas","001","ALLEN",84,108,92]
["Kansas","003","ANDERSON",93,118,101]
["Kansas","005","ATCHISON",93,118,101]
["Kansas","011","BOURBON",84,108,92]
["Kansas","013","BROWN",93,118,101]
["Kansas","021","CHEROKEE",84,108,92]
["Kansas","031","COFFEY",93,118,101]
["Kansas","037","CRAWFORD",84,108,92]
["Kansas","043","DONIPHAN",93,118,101]
["Kansas","045","DOUGLAS",93,118,101]
["Kansas","059","FRANKLIN",93,118,101]
["Kansas","061","GEARY",93,118,101]
["Kansas","085","JACKSON",93,118,101]
["Kansas","087","JEFFERSON",93,118,101]
["Kansas","091","JOHNSON",93,118,101]
["Kansas","099","LABETTE",84,108,92]
["Kansas",103,"LEAVENWORTH",93,118,101]
["Kansas",107,"LINN",93,118,101]
["Kansas",111,"LYON",93,118,101]
["Kansas",117,"MARSHALL",93,118,101]
["Kansas",121,"MIAMI",93,118,101]
["Kansas",125,"MONTGOMERY",84,108,92]
["Kansas",127,"MORRIS",93,118,101]
["Kansas",131,"NEMAHA",93,118,101]
["Kansas",133,"NEOSHO",84,108,92]
["Kansas",139,"OSAGE",93,118,101]
["Kansas",149,"POTTAWATOMIE",93,118,101]
["Kansas",161,"RILEY",93,118,101]
["Kansas",177,"SHAWNEE",93,118,101]
["Kansas",197,"WABAUNSEE",93,118,101]
["Kansas",205,"WILSON",84,108,92]
["Kansas",207,"WOODSON",84,108,92]
["Kansas",209,"WYANDOTTE",93,118,101]
["Kansas",null,"ALL OTHER COUNTIES",87,114,95]
["Kentucky",null,"ALL OTHER COUNTIES",85,112,92]
["Louisiana",null,"ALL OTHER COUNTIES",82,107,90]
["Maine",null,"ALL OTHER COUNTIES",90,117,95]
["Maryland","011","CAROLINE",82,107,90]
["Maryland","019","DORCHESTER",82,107,90]
["Maryland","029","KENT",82,107,90]
["Maryland","035","QUEEN ANNE'S",82,107,90]
["Maryland","039","SOMERSET",82,107,90]
["Maryland","041","TALBOT",82,107,90]
["Maryland","045","WICOMICO",82,107,90]
["Maryland","047","WORCESTER",82,107,90]
["Maryland",null,"ALL OTHER COUNTIES",99,124,102]
["Massachusetts","001","BARNSTABLE",103,127,111]
["Massachusetts","005","BRISTOL",103,127,111]
["Massachusetts","009","ESSEX",103,127,111]
["Massachusetts","017","MIDDLESEX",103,127,111]
["Massachusetts","021","NORFOLK",103,127,111]
["Massachusetts","023","PLYMOUTH",103,127,111]
["Massachusetts","025","SUFFOLK",103,127,111]
["Massachusetts","027","WORCESTER",103,127,111]
["Massachusetts",null,"ALL OTHER COUNTIES",99,127,103]
["Manitoba",null,"ALL OTHER COUNTIES",96,124,103]
["Michigan","099","MACOMB",93,118,101]
["Michigan",115,"MONROE",93,118,101]
["Michigan",125,"OAKLAND",93,118,101]
["Michigan",147,"SAINT CLAIR",93,118,101]
["Michigan",161,"WASHTENAW",93,118,101]
["Michigan",163,"WAYNE",93,118,101]
["Michigan",null,"ALL OTHER COUNTIES",87,114,95]
["Minnesota","003","ANOKA",96,124,103]
["Minnesota","019","CARVER",96,124,103]
["Minnesota","025","CHISAGO",96,124,103]
["Minnesota","037","DAKOTA",96,124,103]
["Minnesota","049","GOODHUE",96,124,103]
["Minnesota","053","HENNEPIN",96,124,103]
["Minnesota","059","ISANTI",96,124,103]
["Minnesota","079","LE SUEUR",96,124,103]
["Minnesota","085","MCLEOD",96,124,103]
["Minnesota","093","MEEKER",96,124,103]
["Minnesota",123,"RAMSEY",96,124,103]
["Minnesota",131,"RICE",96,124,103]
["Minnesota",139,"SCOTT",96,124,103]
["Minnesota",141,"SHERBURNE",96,124,103]
["Minnesota",163,"WASHINGTON",96,124,103]
["Minnesota",171,"WRIGHT",96,124,103]
["Minnesota",null,"ALL OTHER COUNTIES",84,108,92]
["Mississippi","033","DE SOTO",87,114,95]
["Mississippi","093","MARSHALL",87,114,95]
["Mississippi",107,"PANOLA",87,114,95]
["Mississippi",137,"TATE",87,114,95]
["Mississippi",143,"TUNICA",87,114,95]
["Mississippi",null,"ALL OTHER COUNTIES",82,107,90]
["Missouri","009","BARRY",84,108,92]
["Missouri","011","BARTON",84,108,92]
["Missouri","029","CAMDEN",84,108,92]
["Missouri","035","CARTER",84,108,92]
["Missouri","039","CEDAR",84,108,92]
["Missouri","043","CHRISTIAN",84,108,92]
["Missouri","057","DADE",84,108,92]
["Missouri","059","DALLAS",84,108,92]
["Missouri","067","DOUGLAS",84,108,92]
["Missouri","069","DUNKLIN",84,108,92]
["Missouri","077","GREENE",84,108,92]
["Missouri","085","HICKORY",84,108,92]
["Missouri","091","HOWELL",84,108,92]
["Missouri","097","JASPER",84,108,92]
["Missouri",105,"LACLEDE",84,108,92]
["Missouri",109,"LAWRENCE",84,108,92]
["Missouri",119,"MCDONALD",84,108,92]
["Missouri",143,"NEW MADRID",84,108,92]
["Missouri",145,"NEWTON",84,108,92]
["Missouri",149,"OREGON",84,108,92]
["Missouri",153,"OZARK",84,108,92]
["Missouri",155,"PEMISCOT",84,108,92]
["Missouri",167,"POLK",84,108,92]
["Missouri",169,"PULASKI",84,108,92]
["Missouri",181,"RIPLEY",84,108,92]
["Missouri",203,"SHANNON",84,108,92]
["Missouri",209,"STONE",84,108,92]
["Missouri",213,"TANEY",84,108,92]
["Missouri",215,"TEXAS",84,108,92]
["Missouri",217,"VERNON",84,108,92]
["Missouri",225,"WEBSTER",84,108,92]
["Missouri",229,"WRIGHT",84,108,92]
["Missouri",null,"ALL OTHER COUNTIES",93,118,101]
["Montana",null,"ALL OTHER COUNTIES",91,115,98]
["New Brunswick",null,"ALL OTHER COUNTIES",96,124,103]
["Nebraska",null,"ALL OTHER COUNTIES",84,108,92]
["Nevada","003","CLARK",93,115,96]
["Nevada","017","LINCOLN",93,115,96]
["Nevada","023","NYE",93,115,96]
["Nevada",null,"ALL OTHER COUNTIES",96,124,103]
["New Hampshire",null,"ALL OTHER COUNTIES",103,127,111]
["New Jersey","001","ATLANTIC",99,127,103]
["New Jersey","005","BURLINGTON",99,127,103]
["New Jersey","007","CAMDEN",99,127,103]
["New Jersey","009","CAPE MAY",99,127,103]
["New Jersey","011","CUMBERLAND",99,127,103]
["New Jersey","015","GLOUCESTER",99,127,103]
["New Jersey","033","SALEM",99,127,103]
["New Jersey",null,"ALL OTHER COUNTIES",110,132,111]
["New Mexico",null,"ALL OTHER COUNTIES",85,112,92]
["Nova Scotia",null,"ALL OTHER COUNTIES",96,124,103]
["New York","005","BRONX",110,132,111]
["New York","027","DUTCHESS",99,127,103]
["New York","047","KINGS",110,132,111]
["New York","059","NASSAU",110,132,111]
["New York","061","NEW YORK",110,132,111]
["New York","071","ORANGE",99,127,103]
["New York","079","PUTNAM",99,127,103]
["New York","081","QUEENS",110,132,111]
["New York","085","RICHMOND",110,132,111]
["New York","087","ROCKLAND",99,127,103]
["New York",103,"SUFFOLK",110,132,111]
["New York",105,"SULLIVAN",99,127,103]
["New York",111,"ULSTER",99,127,103]
["New York",119,"WESTCHESTER",99,127,103]
["New York",null,"ALL OTHER COUNTIES",93,118,101]
["North Carolina",null,"ALL OTHER COUNTIES",87,114,95]
["North Dakota",null,"ALL OTHER COUNTIES",84,108,92]
["Ohio","001","ADAMS",85,112,92]
["Ohio","003","ALLEN",85,112,92]
["Ohio","005","ASHLAND",93,118,101]
["Ohio","007","ASHTABULA",93,118,101]
["Ohio","009","ATHENS",85,112,92]
["Ohio","011","AUGLAIZE",85,112,92]
["Ohio","013","BELMONT",93,118,101]
["Ohio","015","BROWN",85,112,92]
["Ohio","017","BUTLER",85,112,92]
["Ohio","019","CARROLL",93,118,101]
["Ohio","021","CHAMPAIGN",85,112,92]
["Ohio","023","CLARK",85,112,92]
["Ohio","025","CLERMONT",85,112,92]
["Ohio","027","CLINTON",85,112,92]
["Ohio","029","COLUMBIANA",93,118,101]
["Ohio","035","CUYAHOGA",93,118,101]
["Ohio","043","ERIE",93,118,101]
["Ohio","055","GEAUGA",93,118,101]
["Ohio","061","HAMILTON",85,112,92]
["Ohio","067","HARRISON",93,118,101]
["Ohio","075","HOLMES",93,118,101]
["Ohio","077","HURON",93,118,101]
["Ohio","081","JEFFERSON",93,118,101]
["Ohio","085","LAKE",93,118,101]
["Ohio","093","LORAIN",93,118,101]
["Ohio","099","MAHONING",93,118,101]
["Ohio",103,"MEDINA",93,118,101]
["Ohio",133,"PORTAGE",93,118,101]
["Ohio",139,"RICHLAND",93,118,101]
["Ohio",151,"STARK",93,118,101]
["Ohio",153,"SUMMIT",93,118,101]
["Ohio",155,"TRUMBULL",93,118,101]
["Ohio",157,"TUSCARAWAS",93,118,101]
["Ohio",165,"WARREN",85,112,92]
["Ohio",167,"WASHINGTON",85,112,92]
["Ohio",169,"WAYNE",93,118,101]
["Ohio",null,"ALL OTHER COUNTIES",90,117,96]
["Oklahoma",null,"ALL OTHER COUNTIES",84,108,92]
["Ontario",null,"ALL OTHER COUNTIES",96,124,103]
["Oregon",null,"ALL OTHER COUNTIES",93,118,101]
["Oregon","001","BAKER",78,103,85]
["Oregon","045","MALHUER",78,103,85]
["Oregon","061","UNION",78,103,85]
["Pennsylvania","003","ALLEGHENY",93,118,101]
["Pennsylvania","005","ARMSTRONG",93,118,101]
["Pennsylvania","007","BEAVER",93,118,101]
["Pennsylvania","017","BUCKS",99,127,103]
["Pennsylvania","019","BUTLER",93,118,101]
["Pennsylvania","021","CAMBRIA",93,118,101]
["Pennsylvania","029","CHESTER",99,127,103]
["Pennsylvania","031","CLARION",82,107,90]
["Pennsylvania","039","CRAWFORD",82,107,90]
["Pennsylvania","045","DELAWARE",99,127,103]
["Pennsylvania","049","ERIE",82,107,90]
["Pennsylvania","051","FAYETTE",93,118,101]
["Pennsylvania","053","FOREST",82,107,90]
["Pennsylvania","059","GREENE",93,118,101]
["Pennsylvania","063","INDIANA",93,118,101]
["Pennsylvania","069","LACKAWANNA",93,118,101]
["Pennsylvania","073","LAWRENCE",93,118,101]
["Pennsylvania","085","MERCER",82,107,90]
["Pennsylvania","091","MONTGOMERY",99,127,103]
["Pennsylvania",101,"PHILADELPHIA",99,127,103]
["Pennsylvania",111,"SOMERSET",93,118,101]
["Pennsylvania",115,"SUSQUEHANNA",93,118,101]
["Pennsylvania",121,"VENANGO",82,107,90]
["Pennsylvania",123,"WARREN",82,107,90]
["Pennsylvania",125,"WASHINGTON",93,118,101]
["Pennsylvania",127,"WAYNE",93,118,101]
["Pennsylvania",129,"WESTMORELAND",93,118,101]
["Pennsylvania",131,"WYOMING",93,118,101]
["Pennsylvania",null,"ALL OTHER COUNTIES",99,124,102]
["Quebec",null,"ALL OTHER COUNTIES",96,124,103]
["Rhode Island",null,"ALL OTHER COUNTIES",99,127,103]
["South Carolina",null,"ALL OTHER COUNTIES",85,112,92]
["South Dakota",null,"ALL OTHER COUNTIES",84,108,92]
["Saskatchewan",null,"ALL OTHER COUNTIES",96,124,103]
["Tennessee","001","ANDERSON",82,107,90]
["Tennessee","009","BLOUNT",82,107,90]
["Tennessee","013","CAMPBELL",82,107,90]
["Tennessee","019","CARTER",82,107,90]
["Tennessee","025","CLAIBORNE",82,107,90]
["Tennessee","029","COCKE",82,107,90]
["Tennessee","057","GRAINGER",82,107,90]
["Tennessee","059","GREENE",82,107,90]
["Tennessee","063","HAMBLEN",82,107,90]
["Tennessee","067","Hancock",82,107,90]
["Tennessee","073","HAWKINS",82,107,90]
["Tennessee","089","JEFFERSON",82,107,90]
["Tennessee","091","JOHNSON",82,107,90]
["Tennessee","093","KNOX",82,107,90]
["Tennessee",105,"LOUDON",82,107,90]
["Tennessee",107,"MCMINN",82,107,90]
["Tennessee",123,"MONROE",82,107,90]
["Tennessee",129,"MORGAN",82,107,90]
["Tennessee",145,"ROANE",82,107,90]
["Tennessee",151,"SCOTT",82,107,90]
["Tennessee",155,"SEVIER",82,107,90]
["Tennessee",163,"SULLIVAN",82,107,90]
["Tennessee",171,"UNICOI",82,107,90]
["Tennessee",173,"UNION",82,107,90]
["Tennessee",179,"WASHINGTON",82,107,90]
["Tennessee",null,"ALL OTHER COUNTIES",87,114,95]
["Texas","001","ANDERSON",82,107,90]
["Texas","005","ANGELINA",82,107,90]
["Texas","007","ARANSAS",84,108,92]
["Texas","013","ATASCOSA",84,108,92]
["Texas","019","BANDERA",84,108,92]
["Texas","021","BASTROP",84,108,92]
["Texas","025","BEE",84,108,92]
["Texas","027","BELL",84,108,92]
["Texas","029","BEXAR",84,108,92]
["Texas","031","BLANCO",84,108,92]
["Texas","037","BOWIE",82,107,90]
["Texas","047","BROOKS",84,108,92]
["Texas","051","BURLESON",84,108,92]
["Texas","053","BURNET",84,108,92]
["Texas","055","CALDWELL",84,108,92]
["Texas","057","CALHOUN",84,108,92]
["Texas","061","CAMERON",84,108,92]
["Texas","063","CAMP",82,107,90]
["Texas","067","CASS",82,107,90]
["Texas","073","CHEROKEE       ",82,107,90]
["Texas","091","COMAL",84,108,92]
["Texas",109,"CULBERSON",84,108,92]
["Texas",123,"DEWITT",84,108,92]
["Texas",127,"DIMMIT",84,108,92]
["Texas",131,"DUVAL",84,108,92]
["Texas",137,"EDWARDS",84,108,92]
["Texas",141,"EL PASO",84,108,92]
["Texas",143,"EL PASO",84,108,92]
["Texas",149,"FAYETTE",84,108,92]
["Texas",159,"FRANKLIN",82,107,90]
["Texas",163,"FRIO",84,108,92]
["Texas",171,"GILLESPIE",84,108,92]
["Texas",175,"GOLIAD",84,108,92]
["Texas",177,"GONZALES",84,108,92]
["Texas",183,"GREGG",82,107,90]
["Texas",187,"GUADALUPE",84,108,92]
["Texas",203,"HARRISON",82,107,90]
["Texas",209,"HAYS",84,108,92]
["Texas",213,"HENDERSON",82,107,90]
["Texas",215,"HIDALGO",84,108,92]
["Texas",229,"HUDSPETH",84,108,92]
["Texas",239,"JACKSON",84,108,92]
["Texas",243,"JEFF DAVIS",84,108,92]
["Texas",247,"JIM HOGG",84,108,92]
["Texas",249,"JIM WELLS",84,108,92]
["Texas",255,"KARNES",84,108,92]
["Texas",259,"KENDALL",84,108,92]
["Texas",261,"KENEDY",84,108,92]
["Texas",265,"KERR",84,108,92]
["Texas",267,"KIMBLE",84,108,92]
["Texas",271,"KINNEY",84,108,92]
["Texas",273,"KLEBERG",84,108,92]
["Texas",283,"LA SALLE",84,108,92]
["Texas",285,"LAVACA",84,108,92]
["Texas",287,"LEE",84,108,92]
["Texas",297,"LIVE OAK",84,108,92]
["Texas",299,"LLANO",84,108,92]
["Texas",301,"LOVING",84,108,92]
["Texas",315,"MARION",82,107,90]
["Texas",319,"MASON",84,108,92]
["Texas",323,"MAVERICK",84,108,92]
["Texas",309,"MCLELLAN",84,108,92]
["Texas",311,"MCMULLEN",84,108,92]
["Texas",325,"MEDINA",84,108,92]
["Texas",343,"MORRIS",82,107,90]
["Texas",347,"NACOGDOCHES",82,107,90]
["Texas",355,"NUECES",84,108,92]
["Texas",365,"PANOLA",82,107,90]
["Texas",385,"REAL",84,108,92]
["Texas",387,"REDRIVER",82,107,90]
["Texas",389,"REEVES",84,108,92]
["Texas",391,"REFUGIO",84,108,92]
["Texas",401,"RUSK",82,107,90]
["Texas",409,"SAN PATRICIO",84,108,92]
["Texas",419,"SHELBY",82,107,90]
["Texas",423,"SMITH",82,107,90]
["Texas",427,"STARR",84,108,92]
["Texas",435,"SUTTON",84,108,92]
["Texas",449,"TITUS",82,107,90]
["Texas",453,"TRAVIS",84,108,92]
["Texas",459,"UPSHUR",82,107,90]
["Texas",463,"UVALDE",84,108,92]
["Texas",465,"VAL VERDE",84,108,92]
["Texas",467,"VAN ZANDT",82,107,90]
["Texas",469,"VICTORIA",84,108,92]
["Texas",479,"WEBB",84,108,92]
["Texas",489,"WILLACY",84,108,92]
["Texas",491,"WILLIAMSON",84,108,92]
["Texas",493,"WILSON",84,108,92]
["Texas",499,"WOOD",82,107,90]
["Texas",505,"ZAPATA",84,108,92]
["Texas",507,"ZAVALA",84,108,92]
["Texas",null,"ALL OTHER COUNTIES",93,118,101]
["Utah",null,"ALL OTHER COUNTIES",85,112,92]
["Vermont","025","WINDHAM",99,127,103]
["Vermont",null,"ALL OTHER COUNTIES",93,118,101]
["Virginia","001","ACCOMACK",82,107,90]
["Virginia",510,"ALEXANDRIA INDEP. CI",99,124,102]
["Virginia","005","ALLEGHANY",82,107,90]
["Virginia","009","AMHERST",82,107,90]
["Virginia","011","APPOMATTOX",82,107,90]
["Virginia","013","ARLINGTON",99,124,102]
["Virginia","017","BATH",82,107,90]
["Virginia","019","BEDFORD",82,107,90]
["Virginia","021","BLAND",82,107,90]
["Virginia","023","BOTETOURT",82,107,90]
["Virginia","031","CAMPBELL",82,107,90]
["Virginia",580,"COVINGTON INDEP. CIT",82,107,90]
["Virginia","045","CRAIG",82,107,90]
["Virginia","059","FAIRFAX",99,124,102]
["Virginia",600,"FAIRFAX INDEP. CITY",99,124,102]
["Virginia","063","FLOYD",82,107,90]
["Virginia","067","FRANKLIN",82,107,90]
["Virginia","071","GILES",82,107,90]
["Virginia","077","GRAYSON",82,107,90]
["Virginia",105,"LEE",82,107,90]
["Virginia",678,"LEXINGTON INDEP. CIT",82,107,90]
["Virginia",107,"LOUDOUN",99,124,102]
["Virginia",680,"LYNCHBURG INDEP. CIT",82,107,90]
["Virginia",683,"MANASSAS INDEP. CITY",99,124,110]
["Virginia",121,"MONTGOMERY",82,107,90]
["Virginia",131,"NORTHAMPTON",82,107,90]
["Virginia",153,"PRINCE WILLIAM",99,124,102]
["Virginia",155,"PULASKI",82,107,90]
["Virginia",750,"RADFORD INDEP. CITY",82,107,90]
["Virginia",161,"ROANOKE",82,107,90]
["Virginia",770,"ROANOKE INDEP. CITY",82,107,90]
["Virginia",163,"ROCKBRIDGE",82,107,90]
["Virginia",167,"RUSSELL",82,107,90]
["Virginia",775,"SALEM INDEP. CITY",82,107,90]
["Virginia",169,"SCOTT",82,107,90]
["Virginia",173,"SMYTH",82,107,90]
["Virginia",179,"STAFFORD",99,124,102]
["Virginia",185,"TAZEWELL",82,107,90]
["Virginia",191,"WASHINGTON",82,107,90]
["Virginia",197,"WYTHE",82,107,90]
["Virginia",null,"ALL OTHER COUNTIES",85,112,92]
["Washington","009","CLALLAM",96,117,101]
["Washington","027","GRAYS HARBOR",96,117,101]
["Washington","029","ISLAND",96,117,101]
["Washington","031","JEFFERSON",96,117,101]
["Washington","033","KING",96,117,101]
["Washington","035","KITSAP",96,117,101]
["Washington","041","LEWIS",96,117,101]
["Washington","045","MASON",96,117,101]
["Washington","053","PIERCE",96,117,101]
["Washington","055","SAN JUAN",96,117,101]
["Washington","057","SKAGIT",96,117,101]
["Washington","061","SNOHOMISH",96,117,101]
["Washington","067","THURSTON",96,117,101]
["Washington","073","WHATCOM",96,117,101]
["Washington",null,"ALL OTHER COUNTIES",93,118,101]
["West Virginia","001","BARBOUR",93,118,101]
["West Virginia","003","BERKELEY",93,118,101]
["West Virginia","009","BROOKE",93,118,101]
["West Virginia","023","GRANT",93,118,101]
["West Virginia","027","HAMPSHIRE",93,118,101]
["West Virginia","029","HANCOCK",93,118,101]
["West Virginia","031","HARDY",93,118,101]
["West Virginia","033","HARRISON",93,118,101]
["West Virginia","037","JEFFERSON",93,118,101]
["West Virginia","041","LEWIS",93,118,101]
["West Virginia","049","MARION",93,118,101]
["West Virginia","051","MARSHALL",93,118,101]
["West Virginia","057","MINERAL",93,118,101]
["West Virginia","061","MONONGALIA",93,118,101]
["West Virginia","065","MORGAN",93,118,101]
["West Virginia","069","OHIO",93,118,101]
["West Virginia","071","PENDLETON",93,118,101]
["West Virginia","077","PRESTON",93,118,101]
["West Virginia","091","TAYLOR",93,118,101]
["West Virginia","093","TUCKER",93,118,101]
["West Virginia","095","TYLER",93,118,101]
["West Virginia",103,"WETZEL",93,118,101]
["West Virginia",null,"ALL OTHER COUNTIES",84,108,92]
["Wisconsin",null,"ALL OTHER COUNTIES",90,117,95]
["Wyoming",null,"ALL OTHER COUNTIES",90,117,95]
["Yukon Territory",null,"ALL OTHER COUNTIES",96,124,103]

{"sheet":"Settings","index":23,"n_rows":27,"n_cols":3,"rows_kept":27,"cut":false,"hidden":true,"merged":[]}
["Type Of Discounts","Low","High"]
["TTDiscount",0,5]
["TTNationalAccount",0,8]
[]
[]
["If No Option"]
["1 - Has Capital "]
["2 - Has own financing option"]
["3 - Does not qualify"]
["4 - Does not like Tennant offering"]
["5 - Other"]
[]
[]
[]
["Monthly Machine Usage"]
[25]
[40]
[60]
[80]
[100]
[125]
[150]
[]
["Terms"]
[36]
[48]
[60]

{"sheet":"Financing","index":24,"n_rows":59,"n_cols":110,"rows_kept":59,"cut":false,"hidden":true,"merged":[[1,103,1,109],[22,103,22,109],[1,87,1,93],[1,95,1,101],[22,95,22,101],[16,3,16,4],[1,35,1,41],[1,43,1,49],[1,51,1,57],[1,3,1,9],[1,11,1,17],[1,71,1,77],[1,79,1,85],[1,19,1,25],[1,27,1,33],[1,67,1,69],[1,59,1,65],[37,3,37,4],[22,79,22,85],[22,87,22,93],[22,35,22,41],[22,43,22,49],[22,51,22,57],[22,59,22,65],[22,67,22,69],[22,71,22,77],[22,3,22,9],[22,11,22,17],[22,19,22,25],[22,27,22,33]]}
["Finance Partner","National Leasing",null,{"$f":"C8","v":"National Leasing"}]
["Equipment Cost",0,null,{"$f":"B8","v":1},null,null,null,null,null,null,null,{"$f":"B9","v":"FMV Sweeper"},null,null,null,null,null,null,null,{"$f":"B10","v":"FMV Scrubber"},null,null,null,null,null,null,null,{"$f":"B11","v":"10% Option"},null,null,null,null,null,null,null,{"$f":"B12","v":"Muni $1 Out Monthly"},null,null,null,null,null,null,null,{"$f":"B13","v":"Muni $1 Out Quarterly"},null,null,null,null,null,null,null,{"$f":"B14","v":"Muni $1 Out Semi-Annually"},null,null,null,null,null,null,null,{"$f":"B15","v":"Muni $1 Out Annually"},null,null,null,null,null,null,null,{"$f":"B16","v":"Rent To Own"},null,null,null,{"$f":"B17","v":"10% PUT"},null,null,null,null,null,null,null,{"$f":"B18","v":"$1.00 - 90 days deferred"},null,null,null,null,null,null,null,{"$f":"B19","v":"FMV Sweeper - 90 days deferred"},null,null,null,null,null,null,null,{"$f":"B20","v":"FMV Scrubber - 90 days deferred"},null,null,null,null,null,null,null,{"$f":"B21","v":"FMV Sweeper - Promo"}]
["Term:",60,null,null,null,5000,10000,25000,50000,100000,null,null,null,5000,10000,25000,50000,100000,null,null,null,5000,10000,25000,50000,100000,null,null,null,5000,10000,25000,50000,100000,null,null,null,5000,10000,25000,50000,100000,null,null,null,5000,10000,25000,50000,100000,null,null,null,5000,10000,25000,50000,100000,null,null,null,5000,10000,25000,50000,100000,null,null,null,1,null,null,null,5000,10000,25000,50000,100000,null,null,null,5000,10000,25000,50000,100000,null,null,null,5000,10000,25000,50000,100000,null,null,null,5000,10000,25000,50000,100000,null,null,null,5000,10000,25000,50000,100000]
["Purchase Option:","FMV Scrubber",null,null,null,"to","to","to","to","to",null,null,null,"to","to","to","to","to",null,null,null,"to","to","to","to","to",null,null,null,"to","to","to","to","to",null,null,null,"to","to","to","to","to",null,null,null,"to","to","to","to","to",null,null,null,"to","to","to","to","to",null,null,null,"to","to","to","to","to",null,null,null,"to",null,null,null,"to","to","to","to","to",null,null,null,"to","to","to","to","to",null,null,null,"to","to","to","to","to",null,null,null,"to","to","to","to","to",null,null,null,"to","to","to","to","to"]
["No money down and payments of:",{"$f":"IF(B1=C8,D17, IF(B1=C9,D38))","v":0},null,"Term","Adv",9999,24999,49999,99999,null,null,"Term","Adv",9999,24999,49999,99999,null,null,"Term","Adv",9999,24999,49999,99999,null,null,"Term","Adv",9999,24999,49999,99999,null,null,"Term","Adv",9999,24999,49999,99999,null,null,"Term","Adv",9999,24999,49999,99999,null,null,"Term","Adv",9999,24999,49999,99999,null,null,"Term","Adv",9999,24999,49999,99999,null,null,"Term","Adv",null,null,"Term","Adv",9999,24999,49999,99999,null,null,"Term","Adv",9999,24999,49999,99999,null,null,"Term","Adv",9999,24999,49999,99999,null,null,"Term","Adv",9999,24999,49999,99999,null,null,"Term","Adv",9999,24999,49999,99999]
["For Calculation",null,null,12,0,null,null,null,null,null,null,12,0,null,null,null,null,null,null,12,0,null,null,null,null,null,null,12,0,null,null,null,null,null,null,12,0,null,null,null,null,null,null,12,0,null,null,null,null,null,null,12,0,null,null,null,null,null,null,12,0,null,null,null,null,null,null,9,0,0.125,null,12,0,null,null,null,null,null,null,12,0,null,null,null,null,null,null,12,0,null,null,null,null,null,null,12,0,null,null,null,null,null,null,12,0]
["Term","Purchase Opt","Select a Finance Partner",24,0,4.7539999999999999E-2,4.7109999999999999E-2,4.6679999999999999E-2,4.6249999999999999E-2,4.6039999999999998E-2,null,24,0,4.1540000000000001E-2,4.1050000000000003E-2,4.0570000000000002E-2,4.0419999999999998E-2,4.0230000000000002E-2,null,24,0,4.3400000000000001E-2,4.2930000000000003E-2,4.2460000000000005E-2,4.2320000000000003E-2,4.2139999999999997E-2,null,24,0,4.3400000000000001E-2,4.2930000000000003E-2,4.2459999999999998E-2,4.2320000000000003E-2,4.2139999999999997E-2,null,24,0,null,null,null,null,null,null,24,0,null,null,null,null,null,null,24,0,null,null,null,null,null,null,24,0,null,null,null,null,null,null,12,0,0.1,null,24,0,null,null,null,null,null,null,24,0,null,null,null,null,null,null,24,0,null,null,null,null,null,null,24,0,null,null,null,null,null,null,24,0]
[12,1,"National Leasing",36,0,3.354E-2,3.3090000000000001E-2,3.2640000000000002E-2,3.2190000000000003E-2,3.1969999999999998E-2,null,36,0,2.9590000000000002E-2,2.9080000000000002E-2,2.8579999999999998E-2,2.843E-2,2.8230000000000002E-2,null,36,0,3.1920000000000004E-2,3.1449999999999999E-2,3.099E-2,3.066E-2,3.066E-2,null,36,0,3.0940000000000002E-2,3.049E-2,3.0040000000000001E-2,2.9899999999999999E-2,2.972E-2,null,36,0,null,null,null,null,null,null,36,0,null,null,null,null,null,null,36,0,null,null,null,null,null,null,36,0,null,null,null,null,null,null,18,0,7.4999999999999997E-2,null,36,0,null,null,null,null,null,null,36,0,null,null,null,null,null,null,36,0,null,null,null,null,null,null,36,0,null,null,null,null,null,null,36,0]
[24,"FMV Sweeper","Wells Fargo Vendor Solutions",48,0,2.6589999999999999E-2,2.6120000000000001E-2,2.5660000000000002E-2,2.5190000000000001E-2,2.4960000000000003E-2,null,48,0,2.3969999999999998E-2,2.3460000000000002E-2,2.2949999999999998E-2,2.2800000000000001E-2,2.2599999999999999E-2,null,48,0,2.53E-2,2.4809999999999999E-2,2.4329999999999997E-2,2.419E-2,2.4E-2,null,48,0,2.4469999999999999E-2,2.3970000000000002E-2,2.3470000000000001E-2,2.332E-2,2.3120000000000002E-2,null,48,0,null,null,null,null,null,null,48,0,null,null,null,null,null,null,48,0,null,null,null,null,null,null,48,0,null,null,null,null,null,null,null,null,null,null,48,0,null,null,null,null,null,null,48,0,null,null,null,null,null,null,48,0,null,null,null,null,null,null,48,0,null,null,null,null,null,null,48,0]
[36,"FMV Scrubber",null,60,0,2.2460000000000001E-2,2.198E-2,2.1489999999999999E-2,2.102E-2,2.078E-2,null,60,0,2.1350000000000001E-2,2.085E-2,2.036E-2,2.0209999999999999E-2,2.002E-2,null,60,0,2.1350000000000001E-2,2.085E-2,2.036E-2,2.0209999999999999E-2,2.002E-2,null,60,0,2.0480000000000002E-2,1.9990000000000001E-2,1.95E-2,1.9359999999999999E-2,1.917E-2,null,60,0,null,null,null,null,null,null,60,0,null,null,null,null,null,null,60,0,null,null,null,null,null,null,60,0,null,null,null,null,null,null,null,null,null,null,60,0,null,null,null,null,null,null,60,0,null,null,null,null,null,null,60,0,null,null,null,null,null,null,60,0,null,null,null,null,null,null,60,0]
[48,"10% Option"]
[60,"Muni $1 Out Monthly",null,12,0,{"$f":"IF(AND(F$3<=$B$2,$B$2<G$3,$B$3=$A$8,$B$4=D2),F6*$B$2,0)","v":0},{"$f":"IF(AND(G$3<=$B$2,$B$2<H$3,$B$3=$A$8,$B$4=D2),G6*$B$2,0)","v":0},{"$f":"IF(AND(H$3<=$B$2,$B$2<I$3,$B$3=$A$8,$B$4=D2),H6*$B$2,0)","v":0},{"$f":"IF(AND(I$3<=$B$2,$B$2<J$3,$B$3=$A$8,$B$4=D2),I6*$B$2,0)","v":0},{"$f":"IF(AND(J$3<=$B$2,$B$3=$A$8,$B$4=D2),J6*$B$2,0)","v":0},null,12,0,{"$f":"IF(AND(N$3<=$B$2,$B$2<O$3,$B$3=$A$8,$B$4=L2),N6*$B$2,0)","v":0},{"$f":"IF(AND(O$3<=$B$2,$B$2<P$3,$B$3=$A$8,$B$4=L2),O6*$B$2,0)","v":0},{"$f":"IF(AND(P$3<=$B$2,$B$2<Q$3,$B$3=$A$8,$B$4=L2),P6*$B$2,0)","v":0},{"$f":"IF(AND(Q$3<=$B$2,$B$2<R$3,$B$3=$A$8,$B$4=L2),Q6*$B$2,0)","v":0},{"$f":"IF(AND(R$3<=$B$2,$B$3=$A$8,$B$4=L2),R6*$B$2,0)","v":0},null,12,0,{"$f":"IF(AND(V$3<=$B$2,$B$2<W$3,$B$3=$A$8,$B$4=T2),V6*$B$2,0)","v":0},{"$f":"IF(AND(W$3<=$B$2,$B$2<X$3,$B$3=$A$8,$B$4=T2),W6*$B$2,0)","v":0},{"$f":"IF(AND(X$3<=$B$2,$B$2<Y$3,$B$3=$A$8,$B$4=T2),X6*$B$2,0)","v":0},{"$f":"IF(AND(Y$3<=$B$2,$B$2<Z$3,$B$3=$A$8,$B$4=T2),Y6*$B$2,0)","v":0},{"$f":"IF(AND(Z$3<=$B$2,$B$3=$A$8,$B$4=T2),Z6*$B$2,0)","v":0},null,12,0,{"$f":"IF(AND(AD$3<=$B$2,$B$2<AE$3,$B$3=$A$8,$B$4=AB2),AD6*$B$2,0)","v":0},{"$f":"IF(AND(AE$3<=$B$2,$B$2<AF$3,$B$3=$A$8,$B$4=AB2),AE6*$B$2,0)","v":0},{"$f":"IF(AND(AF$3<=$B$2,$B$2<AG$3,$B$3=$A$8,$B$4=AB2),AF6*$B$2,0)","v":0},{"$f":"IF(AND(AG$3<=$B$2,$B$2<AH$3,$B$3=$A$8,$B$4=AB2),AG6*$B$2,0)","v":0},{"$f":"IF(AND(AH$3<=$B$2,$B$3=$A$8,$B$4=AB2),AH6*$B$2,0)","v":0},null,12,0,{"$f":"IF(AND(AL$3<=$B$2,$B$2<AM$3,$B$3=$A$8,$B$4=AJ2),AL6*$B$2,0)","v":0},{"$f":"IF(AND(AM$3<=$B$2,$B$2<AN$3,$B$3=$A$8,$B$4=AJ2),AM6*$B$2,0)","v":0},{"$f":"IF(AND(AN$3<=$B$2,$B$2<AO$3,$B$3=$A$8,$B$4=AJ2),AN6*$B$2,0)","v":0},{"$f":"IF(AND(AO$3<=$B$2,$B$2<AP$3,$B$3=$A$8,$B$4=AJ2),AO6*$B$2,0)","v":0},{"$f":"IF(AND(AP$3<=$B$2,$B$3=$A$8,$B$4=AJ2),AP6*$B$2,0)","v":0},null,12,0,{"$f":"IF(AND(AT$3<=$B$2,$B$2<AU$3,$B$3=$A$8,$B$4=AR2),AT6*$B$2,0)","v":0},{"$f":"IF(AND(AU$3<=$B$2,$B$2<AV$3,$B$3=$A$8,$B$4=AR2),AU6*$B$2,0)","v":0},{"$f":"IF(AND(AV$3<=$B$2,$B$2<AW$3,$B$3=$A$8,$B$4=AR2),AV6*$B$2,0)","v":0},{"$f":"IF(AND(AW$3<=$B$2,$B$2<AX$3,$B$3=$A$8,$B$4=AR2),AW6*$B$2,0)","v":0},{"$f":"IF(AND(AX$3<=$B$2,$B$3=$A$8,$B$4=AR2),AX6*$B$2,0)","v":0},null,12,0,{"$f":"IF(AND(BB$3<=$B$2,$B$2<BC$3,$B$3=$A$8,$B$4=AZ2),BB6*$B$2,0)","v":0},{"$f":"IF(AND(BC$3<=$B$2,$B$2<BD$3,$B$3=$A$8,$B$4=AZ2),BC6*$B$2,0)","v":0},{"$f":"IF(AND(BD$3<=$B$2,$B$2<BE$3,$B$3=$A$8,$B$4=AZ2),BD6*$B$2,0)","v":0},{"$f":"IF(AND(BE$3<=$B$2,$B$2<BF$3,$B$3=$A$8,$B$4=AZ2),BE6*$B$2,0)","v":0},{"$f":"IF(AND(BF$3<=$B$2,$B$3=$A$8,$B$4=AZ2),BF6*$B$2,0)","v":0},null,12,0,{"$f":"IF(AND(BJ$3<=$B$2,$B$2<BK$3,$B$3=$A$8,$B$4=BH2),BJ6*$B$2,0)","v":0},{"$f":"IF(AND(BK$3<=$B$2,$B$2<BL$3,$B$3=$A$8,$B$4=BH2),BK6*$B$2,0)","v":0},{"$f":"IF(AND(BL$3<=$B$2,$B$2<BM$3,$B$3=$A$8,$B$4=BH2),BL6*$B$2,0)","v":0},{"$f":"IF(AND(BM$3<=$B$2,$B$2<BN$3,$B$3=$A$8,$B$4=BH2),BM6*$B$2,0)","v":0},{"$f":"IF(AND(BN$3<=$B$2,$B$3=$A$8,$B$4=BH2),BN6*$B$2,0)","v":0},null,9,0,{"$f":"IF(AND(BR$3<=$B$2,$B$3=$A$13,$B$4=BP2),BR6*$B$2,0)","v":0},null,12,0,{"$f":"IF(AND(BV$3<=$B$2,$B$2<BW$3,$B$3=$A$8,$B$4=BT2),BV6*$B$2,0)","v":0},{"$f":"IF(AND(BW$3<=$B$2,$B$2<BX$3,$B$3=$A$8,$B$4=BT2),BW6*$B$2,0)","v":0},{"$f":"IF(AND(BX$3<=$B$2,$B$2<BY$3,$B$3=$A$8,$B$4=BT2),BX6*$B$2,0)","v":0},{"$f":"IF(AND(BY$3<=$B$2,$B$2<BZ$3,$B$3=$A$8,$B$4=BT2),BY6*$B$2,0)","v":0},{"$f":"IF(AND(BZ$3<=$B$2,$B$3=$A$8,$B$4=BT2),BZ6*$B$2,0)","v":0},null,12,0,{"$f":"IF(AND(CD$3<=$B$2,$B$2<CE$3,$B$3=$A$8,$B$4=CB2),CD6*$B$2,0)","v":0},{"$f":"IF(AND(CE$3<=$B$2,$B$2<CF$3,$B$3=$A$8,$B$4=CB2),CE6*$B$2,0)","v":0},{"$f":"IF(AND(CF$3<=$B$2,$B$2<CG$3,$B$3=$A$8,$B$4=CB2),CF6*$B$2,0)","v":0},{"$f":"IF(AND(CG$3<=$B$2,$B$2<CH$3,$B$3=$A$8,$B$4=CB2),CG6*$B$2,0)","v":0},{"$f":"IF(AND(CH$3<=$B$2,$B$3=$A$8,$B$4=CB2),CH6*$B$2,0)","v":0},null,12,0,{"$f":"IF(AND(CL$3<=$B$2,$B$2<CM$3,$B$3=$A$8,$B$4=CJ2),CL6*$B$2,0)","v":0},{"$f":"IF(AND(CM$3<=$B$2,$B$2<CN$3,$B$3=$A$8,$B$4=CJ2),CM6*$B$2,0)","v":0},{"$f":"IF(AND(CN$3<=$B$2,$B$2<CO$3,$B$3=$A$8,$B$4=CJ2),CN6*$B$2,0)","v":0},{"$f":"IF(AND(CO$3<=$B$2,$B$2<CP$3,$B$3=$A$8,$B$4=CJ2),CO6*$B$2,0)","v":0},{"$f":"IF(AND(CP$3<=$B$2,$B$3=$A$8,$B$4=CJ2),CP6*$B$2,0)","v":0},null,12,0,{"$f":"IF(AND(CT$3<=$B$2,$B$2<CU$3,$B$3=$A$8,$B$4=CR2),CT6*$B$2,0)","v":0},{"$f":"IF(AND(CU$3<=$B$2,$B$2<CV$3,$B$3=$A$8,$B$4=CR2),CU6*$B$2,0)","v":0},{"$f":"IF(AND(CV$3<=$B$2,$B$2<CW$3,$B$3=$A$8,$B$4=CR2),CV6*$B$2,0)","v":0},{"$f":"IF(AND(CW$3<=$B$2,$B$2<CX$3,$B$3=$A$8,$B$4=CR2),CW6*$B$2,0)","v":0},{"$f":"IF(AND(CX$3<=$B$2,$B$3=$A$8,$B$4=CR2),CX6*$B$2,0)","v":0},null,12,0,{"$f":"IF(AND(DB$3<=$B$2,$B$2<DC$3,$B$3=$A$8,$B$4=CZ2),DB6*$B$2,0)","v":0},{"$f":"IF(AND(DC$3<=$B$2,$B$2<DD$3,$B$3=$A$8,$B$4=CZ2),DC6*$B$2,0)","v":0},{"$f":"IF(AND(DD$3<=$B$2,$B$2<DE$3,$B$3=$A$8,$B$4=CZ2),DD6*$B$2,0)","v":0},{"$f":"IF(AND(DE$3<=$B$2,$B$2<DF$3,$B$3=$A$8,$B$4=CZ2),DE6*$B$2,0)","v":0},{"$f":"IF(AND(DF$3<=$B$2,$B$3=$A$8,$B$4=CZ2),DF6*$B$2,0)","v":0}]
[9,"Muni $1 Out Quarterly",null,24,0,{"$f":"IF(AND(F$3<=$B$2,$B$2<G$3,$B$3=$A$9,$B$4=D2),F7*$B$2,0)","v":0},{"$f":"IF(AND(G$3<=$B$2,$B$2<H$3,$B$3=$A$9,$B$4=D2),G7*$B$2,0)","v":0},{"$f":"IF(AND(H$3<=$B$2,$B$2<I$3,$B$3=$A$9,$B$4=D2),H7*$B$2,0)","v":0},{"$f":"IF(AND(I$3<=$B$2,$B$2<J$3,$B$3=$A$9,$B$4=D2),I7*$B$2,0)","v":0},{"$f":"IF(AND(J$3<=$B$2,$B$3=$A$9,$B$4=D2),J7*$B$2,0)","v":0},null,24,0,{"$f":"IF(AND(N$3<=$B$2,$B$2<O$3,$B$3=$A$9,$B$4=L2),N7*$B$2,0)","v":0},{"$f":"IF(AND(O$3<=$B$2,$B$2<P$3,$B$3=$A$9,$B$4=L2),O7*$B$2,0)","v":0},{"$f":"IF(AND(P$3<=$B$2,$B$2<Q$3,$B$3=$A$9,$B$4=L2),P7*$B$2,0)","v":0},{"$f":"IF(AND(Q$3<=$B$2,$B$2<R$3,$B$3=$A$9,$B$4=L2),Q7*$B$2,0)","v":0},{"$f":"IF(AND(R$3<=$B$2,$B$3=$A$9,$B$4=L2),R7*$B$2,0)","v":0},null,24,0,{"$f":"IF(AND(V$3<=$B$2,$B$2<W$3,$B$3=$A$9,$B$4=T2),V7*$B$2,0)","v":0},{"$f":"IF(AND(W$3<=$B$2,$B$2<X$3,$B$3=$A$9,$B$4=T2),W7*$B$2,0)","v":0},{"$f":"IF(AND(X$3<=$B$2,$B$2<Y$3,$B$3=$A$9,$B$4=T2),X7*$B$2,0)","v":0},{"$f":"IF(AND(Y$3<=$B$2,$B$2<Z$3,$B$3=$A$9,$B$4=T2),Y7*$B$2,0)","v":0},{"$f":"IF(AND(Z$3<=$B$2,$B$3=$A$9,$B$4=T2),Z7*$B$2,0)","v":0},null,24,0,{"$f":"IF(AND(AD$3<=$B$2,$B$2<AE$3,$B$3=$A$9,$B$4=AB2),AD7*$B$2,0)","v":0},{"$f":"IF(AND(AE$3<=$B$2,$B$2<AF$3,$B$3=$A$9,$B$4=AB2),AE7*$B$2,0)","v":0},{"$f":"IF(AND(AF$3<=$B$2,$B$2<AG$3,$B$3=$A$9,$B$4=AB2),AF7*$B$2,0)","v":0},{"$f":"IF(AND(AG$3<=$B$2,$B$2<AH$3,$B$3=$A$9,$B$4=AB2),AG7*$B$2,0)","v":0},{"$f":"IF(AND(AH$3<=$B$2,$B$3=$A$9,$B$4=AB2),AH7*$B$2,0)","v":0},null,24,0,{"$f":"IF(AND(AL$3<=$B$2,$B$2<AM$3,$B$3=$A$9,$B$4=AJ2),AL7*$B$2,0)","v":0},{"$f":"IF(AND(AM$3<=$B$2,$B$2<AN$3,$B$3=$A$9,$B$4=AJ2),AM7*$B$2,0)","v":0},{"$f":"IF(AND(AN$3<=$B$2,$B$2<AO$3,$B$3=$A$9,$B$4=AJ2),AN7*$B$2,0)","v":0},{"$f":"IF(AND(AO$3<=$B$2,$B$2<AP$3,$B$3=$A$9,$B$4=AJ2),AO7*$B$2,0)","v":0},{"$f":"IF(AND(AP$3<=$B$2,$B$3=$A$9,$B$4=AJ2),AP7*$B$2,0)","v":0},null,24,0,{"$f":"IF(AND(AT$3<=$B$2,$B$2<AU$3,$B$3=$A$9,$B$4=AR2),AT7*$B$2,0)","v":0},{"$f":"IF(AND(AU$3<=$B$2,$B$2<AV$3,$B$3=$A$9,$B$4=AR2),AU7*$B$2,0)","v":0},{"$f":"IF(AND(AV$3<=$B$2,$B$2<AW$3,$B$3=$A$9,$B$4=AR2),AV7*$B$2,0)","v":0},{"$f":"IF(AND(AW$3<=$B$2,$B$2<AX$3,$B$3=$A$9,$B$4=AR2),AW7*$B$2,0)","v":0},{"$f":"IF(AND(AX$3<=$B$2,$B$3=$A$9,$B$4=AR2),AX7*$B$2,0)","v":0},null,24,0,{"$f":"IF(AND(BB$3<=$B$2,$B$2<BC$3,$B$3=$A$9,$B$4=AZ2),BB7*$B$2,0)","v":0},{"$f":"IF(AND(BC$3<=$B$2,$B$2<BD$3,$B$3=$A$9,$B$4=AZ2),BC7*$B$2,0)","v":0},{"$f":"IF(AND(BD$3<=$B$2,$B$2<BE$3,$B$3=$A$9,$B$4=AZ2),BD7*$B$2,0)","v":0},{"$f":"IF(AND(BE$3<=$B$2,$B$2<BF$3,$B$3=$A$9,$B$4=AZ2),BE7*$B$2,0)","v":0},{"$f":"IF(AND(BF$3<=$B$2,$B$3=$A$9,$B$4=AZ2),BF7*$B$2,0)","v":0},null,24,0,{"$f":"IF(AND(BJ$3<=$B$2,$B$2<BK$3,$B$3=$A$9,$B$4=BH2),BJ7*$B$2,0)","v":0},{"$f":"IF(AND(BK$3<=$B$2,$B$2<BL$3,$B$3=$A$9,$B$4=BH2),BK7*$B$2,0)","v":0},{"$f":"IF(AND(BL$3<=$B$2,$B$2<BM$3,$B$3=$A$9,$B$4=BH2),BL7*$B$2,0)","v":0},{"$f":"IF(AND(BM$3<=$B$2,$B$2<BN$3,$B$3=$A$9,$B$4=BH2),BM7*$B$2,0)","v":0},{"$f":"IF(AND(BN$3<=$B$2,$B$3=$A$9,$B$4=BH2),BN7*$B$2,0)","v":0},null,12,0,{"$f":"IF(AND(BR$3<=$B$2,$B$3=$A$8,$B$4=BP2),BR7*$B$2,0)","v":0},null,24,0,{"$f":"IF(AND(BV$3<=$B$2,$B$2<BW$3,$B$3=$A$9,$B$4=BT2),BV7*$B$2,0)","v":0},{"$f":"IF(AND(BW$3<=$B$2,$B$2<BX$3,$B$3=$A$9,$B$4=BT2),BW7*$B$2,0)","v":0},{"$f":"IF(AND(BX$3<=$B$2,$B$2<BY$3,$B$3=$A$9,$B$4=BT2),BX7*$B$2,0)","v":0},{"$f":"IF(AND(BY$3<=$B$2,$B$2<BZ$3,$B$3=$A$9,$B$4=BT2),BY7*$B$2,0)","v":0},{"$f":"IF(AND(BZ$3<=$B$2,$B$3=$A$9,$B$4=BT2),BZ7*$B$2,0)","v":0},null,24,0,{"$f":"IF(AND(CD$3<=$B$2,$B$2<CE$3,$B$3=$A$9,$B$4=CB2),CD7*$B$2,0)","v":0},{"$f":"IF(AND(CE$3<=$B$2,$B$2<CF$3,$B$3=$A$9,$B$4=CB2),CE7*$B$2,0)","v":0},{"$f":"IF(AND(CF$3<=$B$2,$B$2<CG$3,$B$3=$A$9,$B$4=CB2),CF7*$B$2,0)","v":0},{"$f":"IF(AND(CG$3<=$B$2,$B$2<CH$3,$B$3=$A$9,$B$4=CB2),CG7*$B$2,0)","v":0},{"$f":"IF(AND(CH$3<=$B$2,$B$3=$A$9,$B$4=CB2),CH7*$B$2,0)","v":0},null,24,0,{"$f":"IF(AND(CL$3<=$B$2,$B$2<CM$3,$B$3=$A$9,$B$4=CJ2),CL7*$B$2,0)","v":0},{"$f":"IF(AND(CM$3<=$B$2,$B$2<CN$3,$B$3=$A$9,$B$4=CJ2),CM7*$B$2,0)","v":0},{"$f":"IF(AND(CN$3<=$B$2,$B$2<CO$3,$B$3=$A$9,$B$4=CJ2),CN7*$B$2,0)","v":0},{"$f":"IF(AND(CO$3<=$B$2,$B$2<CP$3,$B$3=$A$9,$B$4=CJ2),CO7*$B$2,0)","v":0},{"$f":"IF(AND(CP$3<=$B$2,$B$3=$A$9,$B$4=CJ2),CP7*$B$2,0)","v":0},null,24,0,{"$f":"IF(AND(CT$3<=$B$2,$B$2<CU$3,$B$3=$A$9,$B$4=CR2),CT7*$B$2,0)","v":0},{"$f":"IF(AND(CU$3<=$B$2,$B$2<CV$3,$B$3=$A$9,$B$4=CR2),CU7*$B$2,0)","v":0},{"$f":"IF(AND(CV$3<=$B$2,$B$2<CW$3,$B$3=$A$9,$B$4=CR2),CV7*$B$2,0)","v":0},{"$f":"IF(AND(CW$3<=$B$2,$B$2<CX$3,$B$3=$A$9,$B$4=CR2),CW7*$B$2,0)","v":0},{"$f":"IF(AND(CX$3<=$B$2,$B$3=$A$9,$B$4=CR2),CX7*$B$2,0)","v":0},null,24,0,{"$f":"IF(AND(DB$3<=$B$2,$B$2<DC$3,$B$3=$A$9,$B$4=CZ2),DB7*$B$2,0)","v":0},{"$f":"IF(AND(DC$3<=$B$2,$B$2<DD$3,$B$3=$A$9,$B$4=CZ2),DC7*$B$2,0)","v":0},{"$f":"IF(AND(DD$3<=$B$2,$B$2<DE$3,$B$3=$A$9,$B$4=CZ2),DD7*$B$2,0)","v":0},{"$f":"IF(AND(DE$3<=$B$2,$B$2<DF$3,$B$3=$A$9,$B$4=CZ2),DE7*$B$2,0)","v":0},{"$f":"IF(AND(DF$3<=$B$2,$B$3=$A$9,$B$4=CZ2),DF7*$B$2,0)","v":0}]
[18,"Muni $1 Out Semi-Annually",null,36,0,{"$f":"IF(AND(F$3<=$B$2,$B$2<G$3,$B$3=$A$10,$B$4=D2),F8*$B$2,0)","v":0},{"$f":"IF(AND(G$3<=$B$2,$B$2<H$3,$B$3=$A$10,$B$4=D2),G8*$B$2,0)","v":0},{"$f":"IF(AND(H$3<=$B$2,$B$2<I$3,$B$3=$A$10,$B$4=D2),H8*$B$2,0)","v":0},{"$f":"IF(AND(I$3<=$B$2,$B$2<J$3,$B$3=$A$10,$B$4=D2),I8*$B$2,0)","v":0},{"$f":"IF(AND(J$3<=$B$2,$B$3=$A$10,$B$4=D2),J8*$B$2,0)","v":0},null,36,0,{"$f":"IF(AND(N$3<=$B$2,$B$2<O$3,$B$3=$A$10,$B$4=L2),N8*$B$2,0)","v":0},{"$f":"IF(AND(O$3<=$B$2,$B$2<P$3,$B$3=$A$10,$B$4=L2),O8*$B$2,0)","v":0},{"$f":"IF(AND(P$3<=$B$2,$B$2<Q$3,$B$3=$A$10,$B$4=L2),P8*$B$2,0)","v":0},{"$f":"IF(AND(Q$3<=$B$2,$B$2<R$3,$B$3=$A$10,$B$4=L2),Q8*$B$2,0)","v":0},{"$f":"IF(AND(R$3<=$B$2,$B$3=$A$10,$B$4=L2),R8*$B$2,0)","v":0},null,36,0,{"$f":"IF(AND(V$3<=$B$2,$B$2<W$3,$B$3=$A$10,$B$4=T2),V8*$B$2,0)","v":0},{"$f":"IF(AND(W$3<=$B$2,$B$2<X$3,$B$3=$A$10,$B$4=T2),W8*$B$2,0)","v":0},{"$f":"IF(AND(X$3<=$B$2,$B$2<Y$3,$B$3=$A$10,$B$4=T2),X8*$B$2,0)","v":0},{"$f":"IF(AND(Y$3<=$B$2,$B$2<Z$3,$B$3=$A$10,$B$4=T2),Y8*$B$2,0)","v":0},{"$f":"IF(AND(Z$3<=$B$2,$B$3=$A$10,$B$4=T2),Z8*$B$2,0)","v":0},null,36,0,{"$f":"IF(AND(AD$3<=$B$2,$B$2<AE$3,$B$3=$A$10,$B$4=AB2),AD8*$B$2,0)","v":0},{"$f":"IF(AND(AE$3<=$B$2,$B$2<AF$3,$B$3=$A$10,$B$4=AB2),AE8*$B$2,0)","v":0},{"$f":"IF(AND(AF$3<=$B$2,$B$2<AG$3,$B$3=$A$10,$B$4=AB2),AF8*$B$2,0)","v":0},{"$f":"IF(AND(AG$3<=$B$2,$B$2<AH$3,$B$3=$A$10,$B$4=AB2),AG8*$B$2,0)","v":0},{"$f":"IF(AND(AH$3<=$B$2,$B$3=$A$10,$B$4=AB2),AH8*$B$2,0)","v":0},null,36,0,{"$f":"IF(AND(AL$3<=$B$2,$B$2<AM$3,$B$3=$A$10,$B$4=AJ2),AL8*$B$2,0)","v":0},{"$f":"IF(AND(AM$3<=$B$2,$B$2<AN$3,$B$3=$A$10,$B$4=AJ2),AM8*$B$2,0)","v":0},{"$f":"IF(AND(AN$3<=$B$2,$B$2<AO$3,$B$3=$A$10,$B$4=AJ2),AN8*$B$2,0)","v":0},{"$f":"IF(AND(AO$3<=$B$2,$B$2<AP$3,$B$3=$A$10,$B$4=AJ2),AO8*$B$2,0)","v":0},{"$f":"IF(AND(AP$3<=$B$2,$B$3=$A$10,$B$4=AJ2),AP8*$B$2,0)","v":0},null,36,0,{"$f":"IF(AND(AT$3<=$B$2,$B$2<AU$3,$B$3=$A$10,$B$4=AR2),AT8*$B$2,0)","v":0},{"$f":"IF(AND(AU$3<=$B$2,$B$2<AV$3,$B$3=$A$10,$B$4=AR2),AU8*$B$2,0)","v":0},{"$f":"IF(AND(AV$3<=$B$2,$B$2<AW$3,$B$3=$A$10,$B$4=AR2),AV8*$B$2,0)","v":0},{"$f":"IF(AND(AW$3<=$B$2,$B$2<AX$3,$B$3=$A$10,$B$4=AR2),AW8*$B$2,0)","v":0},{"$f":"IF(AND(AX$3<=$B$2,$B$3=$A$10,$B$4=AR2),AX8*$B$2,0)","v":0},null,36,0,{"$f":"IF(AND(BB$3<=$B$2,$B$2<BC$3,$B$3=$A$10,$B$4=AZ2),BB8*$B$2,0)","v":0},{"$f":"IF(AND(BC$3<=$B$2,$B$2<BD$3,$B$3=$A$10,$B$4=AZ2),BC8*$B$2,0)","v":0},{"$f":"IF(AND(BD$3<=$B$2,$B$2<BE$3,$B$3=$A$10,$B$4=AZ2),BD8*$B$2,0)","v":0},{"$f":"IF(AND(BE$3<=$B$2,$B$2<BF$3,$B$3=$A$10,$B$4=AZ2),BE8*$B$2,0)","v":0},{"$f":"IF(AND(BF$3<=$B$2,$B$3=$A$10,$B$4=AZ2),BF8*$B$2,0)","v":0},null,36,0,{"$f":"IF(AND(BJ$3<=$B$2,$B$2<BK$3,$B$3=$A$10,$B$4=BH2),BJ8*$B$2,0)","v":0},{"$f":"IF(AND(BK$3<=$B$2,$B$2<BL$3,$B$3=$A$10,$B$4=BH2),BK8*$B$2,0)","v":0},{"$f":"IF(AND(BL$3<=$B$2,$B$2<BM$3,$B$3=$A$10,$B$4=BH2),BL8*$B$2,0)","v":0},{"$f":"IF(AND(BM$3<=$B$2,$B$2<BN$3,$B$3=$A$10,$B$4=BH2),BM8*$B$2,0)","v":0},{"$f":"IF(AND(BN$3<=$B$2,$B$3=$A$10,$B$4=BH2),BN8*$B$2,0)","v":0},null,18,0,{"$f":"IF(AND(BR$3<=$B$2,$B$3=$A$14,$B$4=BP2),BR8*$B$2,0)","v":0},null,36,0,{"$f":"IF(AND(BV$3<=$B$2,$B$2<BW$3,$B$3=$A$10,$B$4=BT2),BV8*$B$2,0)","v":0},{"$f":"IF(AND(BW$3<=$B$2,$B$2<BX$3,$B$3=$A$10,$B$4=BT2),BW8*$B$2,0)","v":0},{"$f":"IF(AND(BX$3<=$B$2,$B$2<BY$3,$B$3=$A$10,$B$4=BT2),BX8*$B$2,0)","v":0},{"$f":"IF(AND(BY$3<=$B$2,$B$2<BZ$3,$B$3=$A$10,$B$4=BT2),BY8*$B$2,0)","v":0},{"$f":"IF(AND(BZ$3<=$B$2,$B$3=$A$10,$B$4=BT2),BZ8*$B$2,0)","v":0},null,36,0,{"$f":"IF(AND(CD$3<=$B$2,$B$2<CE$3,$B$3=$A$10,$B$4=CB2),CD8*$B$2,0)","v":0},{"$f":"IF(AND(CE$3<=$B$2,$B$2<CF$3,$B$3=$A$10,$B$4=CB2),CE8*$B$2,0)","v":0},{"$f":"IF(AND(CF$3<=$B$2,$B$2<CG$3,$B$3=$A$10,$B$4=CB2),CF8*$B$2,0)","v":0},{"$f":"IF(AND(CG$3<=$B$2,$B$2<CH$3,$B$3=$A$10,$B$4=CB2),CG8*$B$2,0)","v":0},{"$f":"IF(AND(CH$3<=$B$2,$B$3=$A$10,$B$4=CB2),CH8*$B$2,0)","v":0},null,36,0,{"$f":"IF(AND(CL$3<=$B$2,$B$2<CM$3,$B$3=$A$10,$B$4=CJ2),CL8*$B$2,0)","v":0},{"$f":"IF(AND(CM$3<=$B$2,$B$2<CN$3,$B$3=$A$10,$B$4=CJ2),CM8*$B$2,0)","v":0},{"$f":"IF(AND(CN$3<=$B$2,$B$2<CO$3,$B$3=$A$10,$B$4=CJ2),CN8*$B$2,0)","v":0},{"$f":"IF(AND(CO$3<=$B$2,$B$2<CP$3,$B$3=$A$10,$B$4=CJ2),CO8*$B$2,0)","v":0},{"$f":"IF(AND(CP$3<=$B$2,$B$3=$A$10,$B$4=CJ2),CP8*$B$2,0)","v":0},null,36,0,{"$f":"IF(AND(CT$3<=$B$2,$B$2<CU$3,$B$3=$A$10,$B$4=CR2),CT8*$B$2,0)","v":0},{"$f":"IF(AND(CU$3<=$B$2,$B$2<CV$3,$B$3=$A$10,$B$4=CR2),CU8*$B$2,0)","v":0},{"$f":"IF(AND(CV$3<=$B$2,$B$2<CW$3,$B$3=$A$10,$B$4=CR2),CV8*$B$2,0)","v":0},{"$f":"IF(AND(CW$3<=$B$2,$B$2<CX$3,$B$3=$A$10,$B$4=CR2),CW8*$B$2,0)","v":0},{"$f":"IF(AND(CX$3<=$B$2,$B$3=$A$10,$B$4=CR2),CX8*$B$2,0)","v":0},null,36,0,{"$f":"IF(AND(DB$3<=$B$2,$B$2<DC$3,$B$3=$A$10,$B$4=CZ2),DB8*$B$2,0)","v":0},{"$f":"IF(AND(DC$3<=$B$2,$B$2<DD$3,$B$3=$A$10,$B$4=CZ2),DC8*$B$2,0)","v":0},{"$f":"IF(AND(DD$3<=$B$2,$B$2<DE$3,$B$3=$A$10,$B$4=CZ2),DD8*$B$2,0)","v":0},{"$f":"IF(AND(DE$3<=$B$2,$B$2<DF$3,$B$3=$A$10,$B$4=CZ2),DE8*$B$2,0)","v":0},{"$f":"IF(AND(DF$3<=$B$2,$B$3=$A$10,$B$4=CZ2),DF8*$B$2,0)","v":0}]
[null,"Muni $1 Out Annually",null,48,0,{"$f":"IF(AND(F$3<=$B$2,$B$2<G$3,$B$3=$A$11,$B$4=D2),F9*$B$2,0)","v":0},{"$f":"IF(AND(G$3<=$B$2,$B$2<H$3,$B$3=$A$11,$B$4=D2),G9*$B$2,0)","v":0},{"$f":"IF(AND(H$3<=$B$2,$B$2<I$3,$B$3=$A$11,$B$4=D2),H9*$B$2,0)","v":0},{"$f":"IF(AND(I$3<=$B$2,$B$2<J$3,$B$3=$A$11,$B$4=D2),I9*$B$2,0)","v":0},{"$f":"IF(AND(J$3<=$B$2,$B$3=$A$11,$B$4=D2),J9*$B$2,0)","v":0},null,48,0,{"$f":"IF(AND(N$3<=$B$2,$B$2<O$3,$B$3=$A$11,$B$4=L2),N9*$B$2,0)","v":0},{"$f":"IF(AND(O$3<=$B$2,$B$2<P$3,$B$3=$A$11,$B$4=L2),O9*$B$2,0)","v":0},{"$f":"IF(AND(P$3<=$B$2,$B$2<Q$3,$B$3=$A$11,$B$4=L2),P9*$B$2,0)","v":0},{"$f":"IF(AND(Q$3<=$B$2,$B$2<R$3,$B$3=$A$11,$B$4=L2),Q9*$B$2,0)","v":0},{"$f":"IF(AND(R$3<=$B$2,$B$3=$A$11,$B$4=L2),R9*$B$2,0)","v":0},null,48,0,{"$f":"IF(AND(V$3<=$B$2,$B$2<W$3,$B$3=$A$11,$B$4=T2),V9*$B$2,0)","v":0},{"$f":"IF(AND(W$3<=$B$2,$B$2<X$3,$B$3=$A$11,$B$4=T2),W9*$B$2,0)","v":0},{"$f":"IF(AND(X$3<=$B$2,$B$2<Y$3,$B$3=$A$11,$B$4=T2),X9*$B$2,0)","v":0},{"$f":"IF(AND(Y$3<=$B$2,$B$2<Z$3,$B$3=$A$11,$B$4=T2),Y9*$B$2,0)","v":0},{"$f":"IF(AND(Z$3<=$B$2,$B$3=$A$11,$B$4=T2),Z9*$B$2,0)","v":0},null,48,0,{"$f":"IF(AND(AD$3<=$B$2,$B$2<AE$3,$B$3=$A$11,$B$4=AB2),AD9*$B$2,0)","v":0},{"$f":"IF(AND(AE$3<=$B$2,$B$2<AF$3,$B$3=$A$11,$B$4=AB2),AE9*$B$2,0)","v":0},{"$f":"IF(AND(AF$3<=$B$2,$B$2<AG$3,$B$3=$A$11,$B$4=AB2),AF9*$B$2,0)","v":0},{"$f":"IF(AND(AG$3<=$B$2,$B$2<AH$3,$B$3=$A$11,$B$4=AB2),AG9*$B$2,0)","v":0},{"$f":"IF(AND(AH$3<=$B$2,$B$3=$A$11,$B$4=AB2),AH9*$B$2,0)","v":0},null,48,0,{"$f":"IF(AND(AL$3<=$B$2,$B$2<AM$3,$B$3=$A$11,$B$4=AJ2),AL9*$B$2,0)","v":0},{"$f":"IF(AND(AM$3<=$B$2,$B$2<AN$3,$B$3=$A$11,$B$4=AJ2),AM9*$B$2,0)","v":0},{"$f":"IF(AND(AN$3<=$B$2,$B$2<AO$3,$B$3=$A$11,$B$4=AJ2),AN9*$B$2,0)","v":0},{"$f":"IF(AND(AO$3<=$B$2,$B$2<AP$3,$B$3=$A$11,$B$4=AJ2),AO9*$B$2,0)","v":0},{"$f":"IF(AND(AP$3<=$B$2,$B$3=$A$11,$B$4=AJ2),AP9*$B$2,0)","v":0},null,48,0,{"$f":"IF(AND(AT$3<=$B$2,$B$2<AU$3,$B$3=$A$11,$B$4=AR2),AT9*$B$2,0)","v":0},{"$f":"IF(AND(AU$3<=$B$2,$B$2<AV$3,$B$3=$A$11,$B$4=AR2),AU9*$B$2,0)","v":0},{"$f":"IF(AND(AV$3<=$B$2,$B$2<AW$3,$B$3=$A$11,$B$4=AR2),AV9*$B$2,0)","v":0},{"$f":"IF(AND(AW$3<=$B$2,$B$2<AX$3,$B$3=$A$11,$B$4=AR2),AW9*$B$2,0)","v":0},{"$f":"IF(AND(AX$3<=$B$2,$B$3=$A$11,$B$4=AR2),AX9*$B$2,0)","v":0},null,48,0,{"$f":"IF(AND(BB$3<=$B$2,$B$2<BC$3,$B$3=$A$11,$B$4=AZ2),BB9*$B$2,0)","v":0},{"$f":"IF(AND(BC$3<=$B$2,$B$2<BD$3,$B$3=$A$11,$B$4=AZ2),BC9*$B$2,0)","v":0},{"$f":"IF(AND(BD$3<=$B$2,$B$2<BE$3,$B$3=$A$11,$B$4=AZ2),BD9*$B$2,0)","v":0},{"$f":"IF(AND(BE$3<=$B$2,$B$2<BF$3,$B$3=$A$11,$B$4=AZ2),BE9*$B$2,0)","v":0},{"$f":"IF(AND(BF$3<=$B$2,$B$3=$A$11,$B$4=AZ2),BF9*$B$2,0)","v":0},null,48,0,{"$f":"IF(AND(BJ$3<=$B$2,$B$2<BK$3,$B$3=$A$11,$B$4=BH2),BJ9*$B$2,0)","v":0},{"$f":"IF(AND(BK$3<=$B$2,$B$2<BL$3,$B$3=$A$11,$B$4=BH2),BK9*$B$2,0)","v":0},{"$f":"IF(AND(BL$3<=$B$2,$B$2<BM$3,$B$3=$A$11,$B$4=BH2),BL9*$B$2,0)","v":0},{"$f":"IF(AND(BM$3<=$B$2,$B$2<BN$3,$B$3=$A$11,$B$4=BH2),BM9*$B$2,0)","v":0},{"$f":"IF(AND(BN$3<=$B$2,$B$3=$A$11,$B$4=BH2),BN9*$B$2,0)","v":0},null,null,null,null,null,48,0,{"$f":"IF(AND(BV$3<=$B$2,$B$2<BW$3,$B$3=$A$11,$B$4=BT2),BV9*$B$2,0)","v":0},{"$f":"IF(AND(BW$3<=$B$2,$B$2<BX$3,$B$3=$A$11,$B$4=BT2),BW9*$B$2,0)","v":0},{"$f":"IF(AND(BX$3<=$B$2,$B$2<BY$3,$B$3=$A$11,$B$4=BT2),BX9*$B$2,0)","v":0},{"$f":"IF(AND(BY$3<=$B$2,$B$2<BZ$3,$B$3=$A$11,$B$4=BT2),BY9*$B$2,0)","v":0},{"$f":"IF(AND(BZ$3<=$B$2,$B$3=$A$11,$B$4=BT2),BZ9*$B$2,0)","v":0},null,48,0,{"$f":"IF(AND(CD$3<=$B$2,$B$2<CE$3,$B$3=$A$11,$B$4=CB2),CD9*$B$2,0)","v":0},{"$f":"IF(AND(CE$3<=$B$2,$B$2<CF$3,$B$3=$A$11,$B$4=CB2),CE9*$B$2,0)","v":0},{"$f":"IF(AND(CF$3<=$B$2,$B$2<CG$3,$B$3=$A$11,$B$4=CB2),CF9*$B$2,0)","v":0},{"$f":"IF(AND(CG$3<=$B$2,$B$2<CH$3,$B$3=$A$11,$B$4=CB2),CG9*$B$2,0)","v":0},{"$f":"IF(AND(CH$3<=$B$2,$B$3=$A$11,$B$4=CB2),CH9*$B$2,0)","v":0},null,48,0,{"$f":"IF(AND(CL$3<=$B$2,$B$2<CM$3,$B$3=$A$11,$B$4=CJ2),CL9*$B$2,0)","v":0},{"$f":"IF(AND(CM$3<=$B$2,$B$2<CN$3,$B$3=$A$11,$B$4=CJ2),CM9*$B$2,0)","v":0},{"$f":"IF(AND(CN$3<=$B$2,$B$2<CO$3,$B$3=$A$11,$B$4=CJ2),CN9*$B$2,0)","v":0},{"$f":"IF(AND(CO$3<=$B$2,$B$2<CP$3,$B$3=$A$11,$B$4=CJ2),CO9*$B$2,0)","v":0},{"$f":"IF(AND(CP$3<=$B$2,$B$3=$A$11,$B$4=CJ2),CP9*$B$2,0)","v":0},null,48,0,{"$f":"IF(AND(CT$3<=$B$2,$B$2<CU$3,$B$3=$A$11,$B$4=CR2),CT9*$B$2,0)","v":0},{"$f":"IF(AND(CU$3<=$B$2,$B$2<CV$3,$B$3=$A$11,$B$4=CR2),CU9*$B$2,0)","v":0},{"$f":"IF(AND(CV$3<=$B$2,$B$2<CW$3,$B$3=$A$11,$B$4=CR2),CV9*$B$2,0)","v":0},{"$f":"IF(AND(CW$3<=$B$2,$B$2<CX$3,$B$3=$A$11,$B$4=CR2),CW9*$B$2,0)","v":0},{"$f":"IF(AND(CX$3<=$B$2,$B$3=$A$11,$B$4=CR2),CX9*$B$2,0)","v":0},null,48,0,{"$f":"IF(AND(DB$3<=$B$2,$B$2<DC$3,$B$3=$A$11,$B$4=CZ2),DB9*$B$2,0)","v":0},{"$f":"IF(AND(DC$3<=$B$2,$B$2<DD$3,$B$3=$A$11,$B$4=CZ2),DC9*$B$2,0)","v":0},{"$f":"IF(AND(DD$3<=$B$2,$B$2<DE$3,$B$3=$A$11,$B$4=CZ2),DD9*$B$2,0)","v":0},{"$f":"IF(AND(DE$3<=$B$2,$B$2<DF$3,$B$3=$A$11,$B$4=CZ2),DE9*$B$2,0)","v":0},{"$f":"IF(AND(DF$3<=$B$2,$B$3=$A$11,$B$4=CZ2),DF9*$B$2,0)","v":0}]
[null,"Rent To Own",null,60,0,{"$f":"IF(AND(F$3<=$B$2,$B$2<G$3,$B$3=$A$12,$B$4=D2),F10*$B$2,0)","v":0},{"$f":"IF(AND(G$3<=$B$2,$B$2<H$3,$B$3=$A$12,$B$4=D2),G10*$B$2,0)","v":0},{"$f":"IF(AND(H$3<=$B$2,$B$2<I$3,$B$3=$A$12,$B$4=D2),H10*$B$2,0)","v":0},{"$f":"IF(AND(I$3<=$B$2,$B$2<J$3,$B$3=$A$12,$B$4=D2),I10*$B$2,0)","v":0},{"$f":"IF(AND(J$3<=$B$2,$B$3=$A$12,$B$4=D2),J10*$B$2,0)","v":0},null,60,0,{"$f":"IF(AND(N$3<=$B$2,$B$2<O$3,$B$3=$A$12,$B$4=L2),N10*$B$2,0)","v":0},{"$f":"IF(AND(O$3<=$B$2,$B$2<P$3,$B$3=$A$12,$B$4=L2),O10*$B$2,0)","v":0},{"$f":"IF(AND(P$3<=$B$2,$B$2<Q$3,$B$3=$A$12,$B$4=L2),P10*$B$2,0)","v":0},{"$f":"IF(AND(Q$3<=$B$2,$B$2<R$3,$B$3=$A$12,$B$4=L2),Q10*$B$2,0)","v":0},{"$f":"IF(AND(R$3<=$B$2,$B$3=$A$12,$B$4=L2),R10*$B$2,0)","v":0},null,60,0,{"$f":"IF(AND(V$3<=$B$2,$B$2<W$3,$B$3=$A$12,$B$4=T2),V10*$B$2,0)","v":0},{"$f":"IF(AND(W$3<=$B$2,$B$2<X$3,$B$3=$A$12,$B$4=T2),W10*$B$2,0)","v":0},{"$f":"IF(AND(X$3<=$B$2,$B$2<Y$3,$B$3=$A$12,$B$4=T2),X10*$B$2,0)","v":0},{"$f":"IF(AND(Y$3<=$B$2,$B$2<Z$3,$B$3=$A$12,$B$4=T2),Y10*$B$2,0)","v":0},{"$f":"IF(AND(Z$3<=$B$2,$B$3=$A$12,$B$4=T2),Z10*$B$2,0)","v":0},null,60,0,{"$f":"IF(AND(AD$3<=$B$2,$B$2<AE$3,$B$3=$A$12,$B$4=AB2),AD10*$B$2,0)","v":0},{"$f":"IF(AND(AE$3<=$B$2,$B$2<AF$3,$B$3=$A$12,$B$4=AB2),AE10*$B$2,0)","v":0},{"$f":"IF(AND(AF$3<=$B$2,$B$2<AG$3,$B$3=$A$12,$B$4=AB2),AF10*$B$2,0)","v":0},{"$f":"IF(AND(AG$3<=$B$2,$B$2<AH$3,$B$3=$A$12,$B$4=AB2),AG10*$B$2,0)","v":0},{"$f":"IF(AND(AH$3<=$B$2,$B$3=$A$12,$B$4=AB2),AH10*$B$2,0)","v":0},null,60,0,{"$f":"IF(AND(AL$3<=$B$2,$B$2<AM$3,$B$3=$A$12,$B$4=AJ2),AL10*$B$2,0)","v":0},{"$f":"IF(AND(AM$3<=$B$2,$B$2<AN$3,$B$3=$A$12,$B$4=AJ2),AM10*$B$2,0)","v":0},{"$f":"IF(AND(AN$3<=$B$2,$B$2<AO$3,$B$3=$A$12,$B$4=AJ2),AN10*$B$2,0)","v":0},{"$f":"IF(AND(AO$3<=$B$2,$B$2<AP$3,$B$3=$A$12,$B$4=AJ2),AO10*$B$2,0)","v":0},{"$f":"IF(AND(AP$3<=$B$2,$B$3=$A$12,$B$4=AJ2),AP10*$B$2,0)","v":0},null,60,0,{"$f":"IF(AND(AT$3<=$B$2,$B$2<AU$3,$B$3=$A$12,$B$4=AR2),AT10*$B$2,0)","v":0},{"$f":"IF(AND(AU$3<=$B$2,$B$2<AV$3,$B$3=$A$12,$B$4=AR2),AU10*$B$2,0)","v":0},{"$f":"IF(AND(AV$3<=$B$2,$B$2<AW$3,$B$3=$A$12,$B$4=AR2),AV10*$B$2,0)","v":0},{"$f":"IF(AND(AW$3<=$B$2,$B$2<AX$3,$B$3=$A$12,$B$4=AR2),AW10*$B$2,0)","v":0},{"$f":"IF(AND(AX$3<=$B$2,$B$3=$A$12,$B$4=AR2),AX10*$B$2,0)","v":0},null,60,0,{"$f":"IF(AND(BB$3<=$B$2,$B$2<BC$3,$B$3=$A$12,$B$4=AZ2),BB10*$B$2,0)","v":0},{"$f":"IF(AND(BC$3<=$B$2,$B$2<BD$3,$B$3=$A$12,$B$4=AZ2),BC10*$B$2,0)","v":0},{"$f":"IF(AND(BD$3<=$B$2,$B$2<BE$3,$B$3=$A$12,$B$4=AZ2),BD10*$B$2,0)","v":0},{"$f":"IF(AND(BE$3<=$B$2,$B$2<BF$3,$B$3=$A$12,$B$4=AZ2),BE10*$B$2,0)","v":0},{"$f":"IF(AND(BF$3<=$B$2,$B$3=$A$12,$B$4=AZ2),BF10*$B$2,0)","v":0},null,60,0,{"$f":"IF(AND(BJ$3<=$B$2,$B$2<BK$3,$B$3=$A$12,$B$4=BH2),BJ10*$B$2,0)","v":0},{"$f":"IF(AND(BK$3<=$B$2,$B$2<BL$3,$B$3=$A$12,$B$4=BH2),BK10*$B$2,0)","v":0},{"$f":"IF(AND(BL$3<=$B$2,$B$2<BM$3,$B$3=$A$12,$B$4=BH2),BL10*$B$2,0)","v":0},{"$f":"IF(AND(BM$3<=$B$2,$B$2<BN$3,$B$3=$A$12,$B$4=BH2),BM10*$B$2,0)","v":0},{"$f":"IF(AND(BN$3<=$B$2,$B$3=$A$12,$B$4=BH2),BN10*$B$2,0)","v":0},null,null,null,null,null,60,0,{"$f":"IF(AND(BV$3<=$B$2,$B$2<BW$3,$B$3=$A$12,$B$4=BT2),BV10*$B$2,0)","v":0},{"$f":"IF(AND(BW$3<=$B$2,$B$2<BX$3,$B$3=$A$12,$B$4=BT2),BW10*$B$2,0)","v":0},{"$f":"IF(AND(BX$3<=$B$2,$B$2<BY$3,$B$3=$A$12,$B$4=BT2),BX10*$B$2,0)","v":0},{"$f":"IF(AND(BY$3<=$B$2,$B$2<BZ$3,$B$3=$A$12,$B$4=BT2),BY10*$B$2,0)","v":0},{"$f":"IF(AND(BZ$3<=$B$2,$B$3=$A$12,$B$4=BT2),BZ10*$B$2,0)","v":0},null,60,0,{"$f":"IF(AND(CD$3<=$B$2,$B$2<CE$3,$B$3=$A$12,$B$4=CB2),CD10*$B$2,0)","v":0},{"$f":"IF(AND(CE$3<=$B$2,$B$2<CF$3,$B$3=$A$12,$B$4=CB2),CE10*$B$2,0)","v":0},{"$f":"IF(AND(CF$3<=$B$2,$B$2<CG$3,$B$3=$A$12,$B$4=CB2),CF10*$B$2,0)","v":0},{"$f":"IF(AND(CG$3<=$B$2,$B$2<CH$3,$B$3=$A$12,$B$4=CB2),CG10*$B$2,0)","v":0},{"$f":"IF(AND(CH$3<=$B$2,$B$3=$A$12,$B$4=CB2),CH10*$B$2,0)","v":0},null,60,0,{"$f":"IF(AND(CL$3<=$B$2,$B$2<CM$3,$B$3=$A$12,$B$4=CJ2),CL10*$B$2,0)","v":0},{"$f":"IF(AND(CM$3<=$B$2,$B$2<CN$3,$B$3=$A$12,$B$4=CJ2),CM10*$B$2,0)","v":0},{"$f":"IF(AND(CN$3<=$B$2,$B$2<CO$3,$B$3=$A$12,$B$4=CJ2),CN10*$B$2,0)","v":0},{"$f":"IF(AND(CO$3<=$B$2,$B$2<CP$3,$B$3=$A$12,$B$4=CJ2),CO10*$B$2,0)","v":0},{"$f":"IF(AND(CP$3<=$B$2,$B$3=$A$12,$B$4=CJ2),CP10*$B$2,0)","v":0},null,60,0,{"$f":"IF(AND(CT$3<=$B$2,$B$2<CU$3,$B$3=$A$12,$B$4=CR2),CT10*$B$2,0)","v":0},{"$f":"IF(AND(CU$3<=$B$2,$B$2<CV$3,$B$3=$A$12,$B$4=CR2),CU10*$B$2,0)","v":0},{"$f":"IF(AND(CV$3<=$B$2,$B$2<CW$3,$B$3=$A$12,$B$4=CR2),CV10*$B$2,0)","v":0},{"$f":"IF(AND(CW$3<=$B$2,$B$2<CX$3,$B$3=$A$12,$B$4=CR2),CW10*$B$2,0)","v":0},{"$f":"IF(AND(CX$3<=$B$2,$B$3=$A$12,$B$4=CR2),CX10*$B$2,0)","v":0},null,60,0,{"$f":"IF(AND(DB$3<=$B$2,$B$2<DC$3,$B$3=$A$12,$B$4=CZ2),DB10*$B$2,0)","v":0},{"$f":"IF(AND(DC$3<=$B$2,$B$2<DD$3,$B$3=$A$12,$B$4=CZ2),DC10*$B$2,0)","v":0},{"$f":"IF(AND(DD$3<=$B$2,$B$2<DE$3,$B$3=$A$12,$B$4=CZ2),DD10*$B$2,0)","v":0},{"$f":"IF(AND(DE$3<=$B$2,$B$2<DF$3,$B$3=$A$12,$B$4=CZ2),DE10*$B$2,0)","v":0},{"$f":"IF(AND(DF$3<=$B$2,$B$3=$A$12,$B$4=CZ2),DF10*$B$2,0)","v":0}]
[null,"10% PUT",null,{"$f":"SUM(F17:DF17)","v":0},null,{"$f":"SUM(F12:F16)","v":0},{"$f":"SUM(G12:G16)","v":0},{"$f":"SUM(H12:H16)","v":0},{"$f":"SUM(I12:I16)","v":0},{"$f":"SUM(J12:J16)","v":0},null,null,null,{"$f":"SUM(N12:N16)","v":0},{"$f":"SUM(O12:O16)","v":0},{"$f":"SUM(P12:P16)","v":0},{"$f":"SUM(Q12:Q16)","v":0},{"$f":"SUM(R12:R16)","v":0},null,null,null,{"$f":"SUM(V12:V16)","v":0},{"$f":"SUM(W12:W16)","v":0},{"$f":"SUM(X12:X16)","v":0},{"$f":"SUM(Y12:Y16)","v":0},{"$f":"SUM(Z12:Z16)","v":0},null,null,null,{"$f":"SUM(AD12:AD16)","v":0},{"$f":"SUM(AE12:AE16)","v":0},{"$f":"SUM(AF12:AF16)","v":0},{"$f":"SUM(AG12:AG16)","v":0},{"$f":"SUM(AH12:AH16)","v":0},null,null,null,{"$f":"SUM(AL12:AL16)","v":0},{"$f":"SUM(AM12:AM16)","v":0},{"$f":"SUM(AN12:AN16)","v":0},{"$f":"SUM(AO12:AO16)","v":0},{"$f":"SUM(AP12:AP16)","v":0},null,null,null,{"$f":"SUM(AT12:AT16)","v":0},{"$f":"SUM(AU12:AU16)","v":0},{"$f":"SUM(AV12:AV16)","v":0},{"$f":"SUM(AW12:AW16)","v":0},{"$f":"SUM(AX12:AX16)","v":0},null,null,null,{"$f":"SUM(BB12:BB16)","v":0},{"$f":"SUM(BC12:BC16)","v":0},{"$f":"SUM(BD12:BD16)","v":0},{"$f":"SUM(BE12:BE16)","v":0},{"$f":"SUM(BF12:BF16)","v":0},null,null,null,{"$f":"SUM(BJ12:BJ16)","v":0},{"$f":"SUM(BK12:BK16)","v":0},{"$f":"SUM(BL12:BL16)","v":0},{"$f":"SUM(BM12:BM16)","v":0},{"$f":"SUM(BN12:BN16)","v":0},null,null,null,{"$f":"SUM(BR12:BR16)","v":0},null,null,null,{"$f":"SUM(BV12:BV16)","v":0},{"$f":"SUM(BW12:BW16)","v":0},{"$f":"SUM(BX12:BX16)","v":0},{"$f":"SUM(BY12:BY16)","v":0},{"$f":"SUM(BZ12:BZ16)","v":0},null,null,null,{"$f":"SUM(CD12:CD16)","v":0},{"$f":"SUM(CE12:CE16)","v":0},{"$f":"SUM(CF12:CF16)","v":0},{"$f":"SUM(CG12:CG16)","v":0},{"$f":"SUM(CH12:CH16)","v":0},null,null,null,{"$f":"SUM(CL12:CL16)","v":0},{"$f":"SUM(CM12:CM16)","v":0},{"$f":"SUM(CN12:CN16)","v":0},{"$f":"SUM(CO12:CO16)","v":0},{"$f":"SUM(CP12:CP16)","v":0},null,null,null,{"$f":"SUM(CT12:CT16)","v":0},{"$f":"SUM(CU12:CU16)","v":0},{"$f":"SUM(CV12:CV16)","v":0},{"$f":"SUM(CW12:CW16)","v":0},{"$f":"SUM(CX12:CX16)","v":0},null,null,null,{"$f":"SUM(DB12:DB16)","v":0},{"$f":"SUM(DC12:DC16)","v":0},{"$f":"SUM(DD12:DD16)","v":0},{"$f":"SUM(DE12:DE16)","v":0},{"$f":"SUM(DF12:DF16)","v":0}]
[null,"$1.00 - 90 days deferred"]
[null,"FMV Sweeper - 90 days deferred"]
[null,"FMV Scrubber - 90 days deferred"]
[null,"FMV Sweeper - Promo"]
[null,null,null,{"$f":"C9","v":"Wells Fargo Vendor Solutions"},null,"2013-10-01"]
[null,null,null,{"$f":"B8","v":1},null,null,null,null,null,null,null,{"$f":"B9","v":"FMV Sweeper"},null,null,null,null,null,null,null,{"$f":"B10","v":"FMV Scrubber"},null,null,null,null,null,null,null,{"$f":"B11","v":"10% Option"},null,null,null,null,null,null,null,{"$f":"B12","v":"Muni $1 Out Monthly"},null,null,null,null,null,null,null,{"$f":"B13","v":"Muni $1 Out Quarterly"},null,null,null,null,null,null,null,{"$f":"B14","v":"Muni $1 Out Semi-Annually"},null,null,null,null,null,null,null,{"$f":"B15","v":"Muni $1 Out Annually"},null,null,null,null,null,null,null,{"$f":"B16","v":"Rent To Own"},null,null,null,{"$f":"B17","v":"10% PUT"},null,null,null,null,null,null,null,{"$f":"B18","v":"$1.00 - 90 days deferred"},null,null,null,null,null,null,null,{"$f":"B19","v":"FMV Sweeper - 90 days deferred"},null,null,null,null,null,null,null,{"$f":"B20","v":"FMV Scrubber - 90 days deferred"},null,null,null,null,null,null,null,{"$f":"B21","v":"FMV Sweeper - Promo"}]
["For Drop Down","PurchaseOptNL","PurchaseOptTFS",null,null,5000,10000,25000,50000,100000,null,null,null,5000,10000,25000,50000,100000,null,null,null,5000,10000,25000,50000,100000,null,null,null,5000,10000,25000,50000,100000,null,null,null,5000,10000,25000,50000,100000,null,null,null,5000,10000,25000,50000,100000,null,null,null,5000,10000,25000,50000,100000,null,null,null,5000,10000,25000,50000,100000,null,null,null,1,null,null,null,5000,10000,25000,50000,100000,null,null,null,5000,10000,25000,50000,100000,null,null,null,5000,10000,25000,50000,100000,null,null,null,5000,10000,25000,50000,100000,null,null,null,5000,10000,25000,50000,100000]
["Term","Purchase Opt - NL","Purchase Opt - TFS",null,null,"to","to","to","to","to",null,null,null,"to","to","to","to","to",null,null,null,"to","to","to","to","to",null,null,null,"to","to","to","to","to",null,null,null,"to","to","to","to","to",null,null,null,"to","to","to","to","to",null,null,null,"to","to","to","to","to",null,null,null,"to","to","to","to","to",null,null,null,"to",null,null,null,"to","to","to","to","to",null,null,null,"to","to","to","to","to",null,null,null,"to","to","to","to","to",null,null,null,"to","to","to","to","to",null,null,null,"to","to","to","to","to"]
["None","None","None","Term","Adv",9999,24999,49999,99999,null,null,"Term","Adv",9999,24999,49999,99999,null,null,"Term","Adv",9999,24999,49999,99999,null,null,"Term","Adv",9999,24999,49999,99999,null,null,"Term","Adv",9999,24999,49999,99999,null,null,"Term","Adv",9999,24999,49999,99999,null,null,"Term","Adv",9999,24999,49999,99999,null,null,"Term","Adv",9999,24999,49999,99999,null,null,"Term","Adv",null,null,"Term","Adv",9999,24999,49999,99999,null,null,"Term","Adv",9999,24999,49999,99999,null,null,"Term","Adv",9999,24999,49999,99999,null,null,"Term","Adv",9999,24999,49999,99999,null,null,"Term","Adv",9999,24999,49999,99999]
["24 Months",1,1,12,0,null,null,null,null,null,null,12,0,null,null,null,null,null,null,12,0,null,null,null,null,null,null,12,0,null,null,null,null,null,null,12,0,null,null,null,null,null,null,12,0,null,null,null,null,null,null,12,0,null,null,null,null,null,null,12,0,null,null,null,null,null,null,9,0,null,null,12,0,null,null,null,null,null,null,12,0,null,null,null,null,null,null,12,0,null,null,null,null,null,null,12,0,null,null,null,null,null,null,12,0]
["36 Months","FMV Sweeper","$1.00 - 90 days deferred",24,0,4.9391302575159689E-2,4.9391302575159689E-2,4.8668031941964687E-2,4.8452261703151478E-2,4.8452261703151478E-2,null,24,0,3.7140724425741914E-2,3.7140724425741914E-2,3.6058428296601018E-2,3.5596230207767011E-2,3.5596230207767011E-2,null,24,0,4.1390092998970326E-2,4.1390092998970326E-2,4.0382603738295726E-2,3.9952769079215439E-2,3.9952769079215439E-2,null,24,0,4.5787823040414101E-2,4.5787823040414101E-2,4.5010461292826452E-2,4.4778344998994933E-2,4.4778344998994933E-2,null,24,0,null,null,null,null,null,null,24,0,null,null,null,null,null,null,24,0,null,null,null,null,null,null,24,0,null,null,null,null,null,null,12,0,null,null,24,0,null,null,null,null,null,null,24,0,null,null,null,null,null,null,24,0,null,null,null,null,null,null,24,0,null,null,null,null,null,null,24,0]
["48 Months","FMV Scrubber","FMV Sweeper",36,0,3.516442345894117E-2,3.516442345894117E-2,3.4152336714166863E-2,3.4005676693967903E-2,3.4005676693967903E-2,null,36,0,2.9375548172221246E-2,2.9375548172221246E-2,2.7949491775059215E-2,2.7197363009538782E-2,2.7197363009538782E-2,null,36,0,3.262570318070275E-2,3.262570318070275E-2,3.1320374305267046E-2,3.0633816927312724E-2,3.0633816927312724E-2,null,36,0,3.2934478132777861E-2,3.2934478132777861E-2,3.1850782245334372E-2,3.1693500658488249E-2,3.1693500658488249E-2,null,36,0,null,null,null,null,null,null,36,0,null,null,null,null,null,null,36,0,null,null,null,null,null,null,36,0,null,null,null,null,null,null,18,0,null,null,36,0,null,null,null,null,null,null,36,0,null,null,null,null,null,null,36,0,null,null,null,null,null,null,36,0,null,null,null,null,null,null,36,0]
["60 Months","10% Option","FMV Sweeper - 90 days deferred",48,0,2.7932317998093606E-2,2.7932317998093606E-2,2.6544020372267736E-2,2.6296031690327928E-2,2.6296031690327928E-2,null,48,0,2.5045539431140938E-2,2.5045539431140938E-2,2.3740526638023077E-2,2.2978788905342103E-2,2.2978788905342103E-2,null,48,0,2.7469040504582522E-2,2.7469040504582522E-2,2.6279922523132791E-2,2.558859756323521E-2,2.558859756323521E-2,null,48,0,2.6370176203977878E-2,2.6370176203977878E-2,2.4888819521860426E-2,2.4623476789130405E-2,2.4623476789130405E-2,null,48,0,null,null,null,null,null,null,48,0,null,null,null,null,null,null,48,0,null,null,null,null,null,null,48,0,null,null,null,null,null,null,null,null,null,null,48,0,null,null,null,null,null,null,48,0,null,null,null,null,null,null,48,0,null,null,null,null,null,null,48,0,null,null,null,null,null,null,48,0]
[null,null,"FMV Scrubber",60,0,2.364530817395654E-2,2.364530817395654E-2,2.2092329854151389E-2,2.2092329854151389E-2,2.2092329854151389E-2,null,60,0,2.2430519106157294E-2,2.2430519106157294E-2,2.067684706766915E-2,2.0103296612794464E-2,2.0103296612794464E-2,null,60,0,2.3996788013787285E-2,2.3996788013787285E-2,2.2375837302217781E-2,2.1848361771530649E-2,2.1848361771530649E-2,null,60,0,2.2479876554978188E-2,2.2479876554978188E-2,2.0829151011624521E-2,2.0829151011624521E-2,2.0829151011624521E-2,null,60,0,null,null,null,null,null,null,60,0,null,null,null,null,null,null,60,0,null,null,null,null,null,null,60,0,null,null,null,null,null,null,null,null,null,null,60,0,null,null,null,null,null,null,60,0,null,null,null,null,null,null,60,0,null,null,null,null,null,null,60,0,null,null,null,null,null,null,60,0]
[null,null,"FMV Scrubber - 90 days deferred"]
[null,null,"10% Option",12,0,{"$f":"IF(AND(F$24<=$B$2,$B$2<G$24,$B$3=$A$8,$B$4=D23),F27*$B$2,0)","v":0},{"$f":"IF(AND(G$24<=$B$2,$B$2<H$24,$B$3=$A$8,$B$4=D23),G27*$B$2,0)","v":0},{"$f":"IF(AND(H$24<=$B$2,$B$2<I$24,$B$3=$A$8,$B$4=D23),H27*$B$2,0)","v":0},{"$f":"IF(AND(I$24<=$B$2,$B$2<J$24,$B$3=$A$8,$B$4=D23),I27*$B$2,0)","v":0},{"$f":"IF(AND(J$24<=$B$2,$B$3=$A$8,$B$4=D23),J27*$B$2,0)","v":0},null,12,0,{"$f":"IF(AND(N$24<=$B$2,$B$2<O$24,$B$3=$A$8,$B$4=L23),N27*$B$2,0)","v":0},{"$f":"IF(AND(O$24<=$B$2,$B$2<P$24,$B$3=$A$8,$B$4=L23),O27*$B$2,0)","v":0},{"$f":"IF(AND(P$24<=$B$2,$B$2<Q$24,$B$3=$A$8,$B$4=L23),P27*$B$2,0)","v":0},{"$f":"IF(AND(Q$24<=$B$2,$B$2<R$24,$B$3=$A$8,$B$4=L23),Q27*$B$2,0)","v":0},{"$f":"IF(AND(R$24<=$B$2,$B$3=$A$8,$B$4=L23),R27*$B$2,0)","v":0},null,12,0,{"$f":"IF(AND(V$24<=$B$2,$B$2<W$24,$B$3=$A$8,$B$4=T23),V27*$B$2,0)","v":0},{"$f":"IF(AND(W$24<=$B$2,$B$2<X$24,$B$3=$A$8,$B$4=T23),W27*$B$2,0)","v":0},{"$f":"IF(AND(X$24<=$B$2,$B$2<Y$24,$B$3=$A$8,$B$4=T23),X27*$B$2,0)","v":0},{"$f":"IF(AND(Y$24<=$B$2,$B$2<Z$24,$B$3=$A$8,$B$4=T23),Y27*$B$2,0)","v":0},{"$f":"IF(AND(Z$24<=$B$2,$B$3=$A$8,$B$4=T23),Z27*$B$2,0)","v":0},null,12,0,{"$f":"IF(AND(AD$24<=$B$2,$B$2<AE$24,$B$3=$A$8,$B$4=AB23),AD27*$B$2,0)","v":0},{"$f":"IF(AND(AE$24<=$B$2,$B$2<AF$24,$B$3=$A$8,$B$4=AB23),AE27*$B$2,0)","v":0},{"$f":"IF(AND(AF$24<=$B$2,$B$2<AG$24,$B$3=$A$8,$B$4=AB23),AF27*$B$2,0)","v":0},{"$f":"IF(AND(AG$24<=$B$2,$B$2<AH$24,$B$3=$A$8,$B$4=AB23),AG27*$B$2,0)","v":0},{"$f":"IF(AND(AH$24<=$B$2,$B$3=$A$8,$B$4=AB23),AH27*$B$2,0)","v":0},null,12,0,{"$f":"IF(AND(AL$24<=$B$2,$B$2<AM$24,$B$3=$A$8,$B$4=AJ23),AL27*$B$2,0)","v":0},{"$f":"IF(AND(AM$24<=$B$2,$B$2<AN$24,$B$3=$A$8,$B$4=AJ23),AM27*$B$2,0)","v":0},{"$f":"IF(AND(AN$24<=$B$2,$B$2<AO$24,$B$3=$A$8,$B$4=AJ23),AN27*$B$2,0)","v":0},{"$f":"IF(AND(AO$24<=$B$2,$B$2<AP$24,$B$3=$A$8,$B$4=AJ23),AO27*$B$2,0)","v":0},{"$f":"IF(AND(AP$24<=$B$2,$B$3=$A$8,$B$4=AJ23),AP27*$B$2,0)","v":0},null,12,0,{"$f":"IF(AND(AT$24<=$B$2,$B$2<AU$24,$B$3=$A$8,$B$4=AR23),AT27*$B$2,0)","v":0},{"$f":"IF(AND(AU$24<=$B$2,$B$2<AV$24,$B$3=$A$8,$B$4=AR23),AU27*$B$2,0)","v":0},{"$f":"IF(AND(AV$24<=$B$2,$B$2<AW$24,$B$3=$A$8,$B$4=AR23),AV27*$B$2,0)","v":0},{"$f":"IF(AND(AW$24<=$B$2,$B$2<AX$24,$B$3=$A$8,$B$4=AR23),AW27*$B$2,0)","v":0},{"$f":"IF(AND(AX$24<=$B$2,$B$3=$A$8,$B$4=AR23),AX27*$B$2,0)","v":0},null,12,0,{"$f":"IF(AND(BB$24<=$B$2,$B$2<BC$24,$B$3=$A$8,$B$4=AZ23),BB27*$B$2,0)","v":0},{"$f":"IF(AND(BC$24<=$B$2,$B$2<BD$24,$B$3=$A$8,$B$4=AZ23),BC27*$B$2,0)","v":0},{"$f":"IF(AND(BD$24<=$B$2,$B$2<BE$24,$B$3=$A$8,$B$4=AZ23),BD27*$B$2,0)","v":0},{"$f":"IF(AND(BE$24<=$B$2,$B$2<BF$24,$B$3=$A$8,$B$4=AZ23),BE27*$B$2,0)","v":0},{"$f":"IF(AND(BF$24<=$B$2,$B$3=$A$8,$B$4=AZ23),BF27*$B$2,0)","v":0},null,12,0,{"$f":"IF(AND(BJ$24<=$B$2,$B$2<BK$24,$B$3=$A$8,$B$4=BH23),BJ27*$B$2,0)","v":0},{"$f":"IF(AND(BK$24<=$B$2,$B$2<BL$24,$B$3=$A$8,$B$4=BH23),BK27*$B$2,0)","v":0},{"$f":"IF(AND(BL$24<=$B$2,$B$2<BM$24,$B$3=$A$8,$B$4=BH23),BL27*$B$2,0)","v":0},{"$f":"IF(AND(BM$24<=$B$2,$B$2<BN$24,$B$3=$A$8,$B$4=BH23),BM27*$B$2,0)","v":0},{"$f":"IF(AND(BN$24<=$B$2,$B$3=$A$8,$B$4=BH23),BN27*$B$2,0)","v":0},null,9,0,{"$f":"IF(AND(BR$3<=$B$2,$B$3=$A$13,$B$4=BP23),BR27*$B$2,0)","v":0},null,12,0,{"$f":"IF(AND(BV$24<=$B$2,$B$2<BW$24,$B$3=$A$8,$B$4=BT23),BV27*$B$2,0)","v":0},{"$f":"IF(AND(BW$24<=$B$2,$B$2<BX$24,$B$3=$A$8,$B$4=BT23),BW27*$B$2,0)","v":0},{"$f":"IF(AND(BX$24<=$B$2,$B$2<BY$24,$B$3=$A$8,$B$4=BT23),BX27*$B$2,0)","v":0},{"$f":"IF(AND(BY$24<=$B$2,$B$2<BZ$24,$B$3=$A$8,$B$4=BT23),BY27*$B$2,0)","v":0},{"$f":"IF(AND(BZ$24<=$B$2,$B$3=$A$8,$B$4=BT23),BZ27*$B$2,0)","v":0},null,12,0,{"$f":"IF(AND(CD$24<=$B$2,$B$2<CE$24,$B$3=$A$8,$B$4=CB23),CD27*$B$2,0)","v":0},{"$f":"IF(AND(CE$24<=$B$2,$B$2<CF$24,$B$3=$A$8,$B$4=CB23),CE27*$B$2,0)","v":0},{"$f":"IF(AND(CF$24<=$B$2,$B$2<CG$24,$B$3=$A$8,$B$4=CB23),CF27*$B$2,0)","v":0},{"$f":"IF(AND(CG$24<=$B$2,$B$2<CH$24,$B$3=$A$8,$B$4=CB23),CG27*$B$2,0)","v":0},{"$f":"IF(AND(CH$24<=$B$2,$B$3=$A$8,$B$4=CB23),CH27*$B$2,0)","v":0},null,12,0,{"$f":"IF(AND(CL$24<=$B$2,$B$2<CM$24,$B$3=$A$8,$B$4=CJ23),CL27*$B$2,0)","v":0},{"$f":"IF(AND(CM$24<=$B$2,$B$2<CN$24,$B$3=$A$8,$B$4=CJ23),CM27*$B$2,0)","v":0},{"$f":"IF(AND(CN$24<=$B$2,$B$2<CO$24,$B$3=$A$8,$B$4=CJ23),CN27*$B$2,0)","v":0},{"$f":"IF(AND(CO$24<=$B$2,$B$2<CP$24,$B$3=$A$8,$B$4=CJ23),CO27*$B$2,0)","v":0},{"$f":"IF(AND(CP$24<=$B$2,$B$3=$A$8,$B$4=CJ23),CP27*$B$2,0)","v":0},null,12,0,{"$f":"IF(AND(CT$24<=$B$2,$B$2<CU$24,$B$3=$A$8,$B$4=CR23),CT27*$B$2,0)","v":0},{"$f":"IF(AND(CU$24<=$B$2,$B$2<CV$24,$B$3=$A$8,$B$4=CR23),CU27*$B$2,0)","v":0},{"$f":"IF(AND(CV$24<=$B$2,$B$2<CW$24,$B$3=$A$8,$B$4=CR23),CV27*$B$2,0)","v":0},{"$f":"IF(AND(CW$24<=$B$2,$B$2<CX$24,$B$3=$A$8,$B$4=CR23),CW27*$B$2,0)","v":0},{"$f":"IF(AND(CX$24<=$B$2,$B$3=$A$8,$B$4=CR23),CX27*$B$2,0)","v":0},null,12,0,{"$f":"IF(AND(DB$24<=$B$2,$B$2<DC$24,$B$3=$A$8,$B$4=CZ23),DB27*$B$2,0)","v":0},{"$f":"IF(AND(DC$24<=$B$2,$B$2<DD$24,$B$3=$A$8,$B$4=CZ23),DC27*$B$2,0)","v":0},{"$f":"IF(AND(DD$24<=$B$2,$B$2<DE$24,$B$3=$A$8,$B$4=CZ23),DD27*$B$2,0)","v":0},{"$f":"IF(AND(DE$24<=$B$2,$B$2<DF$24,$B$3=$A$8,$B$4=CZ23),DE27*$B$2,0)","v":0},{"$f":"IF(AND(DF$24<=$B$2,$B$3=$A$8,$B$4=CZ23),DF27*$B$2,0)","v":0}]
[null,null,"10% PUT",24,0,{"$f":"IF(AND(F$24<=$B$2,$B$2<G$24,$B$3=$A$9,$B$4=D23),F28*$B$2,0)","v":0},{"$f":"IF(AND(G$24<=$B$2,$B$2<H$24,$B$3=$A$9,$B$4=D23),G28*$B$2,0)","v":0},{"$f":"IF(AND(H$24<=$B$2,$B$2<I$24,$B$3=$A$9,$B$4=D23),H28*$B$2,0)","v":0},{"$f":"IF(AND(I$24<=$B$2,$B$2<J$24,$B$3=$A$9,$B$4=D23),I28*$B$2,0)","v":0},{"$f":"IF(AND(J$24<=$B$2,$B$3=$A$9,$B$4=D23),J28*$B$2,0)","v":0},null,24,0,{"$f":"IF(AND(N$24<=$B$2,$B$2<O$24,$B$3=$A$9,$B$4=L23),N28*$B$2,0)","v":0},{"$f":"IF(AND(O$24<=$B$2,$B$2<P$24,$B$3=$A$9,$B$4=L23),O28*$B$2,0)","v":0},{"$f":"IF(AND(P$24<=$B$2,$B$2<Q$24,$B$3=$A$9,$B$4=L23),P28*$B$2,0)","v":0},{"$f":"IF(AND(Q$24<=$B$2,$B$2<R$24,$B$3=$A$9,$B$4=L23),Q28*$B$2,0)","v":0},{"$f":"IF(AND(R$24<=$B$2,$B$3=$A$9,$B$4=L23),R28*$B$2,0)","v":0},null,24,0,{"$f":"IF(AND(V$24<=$B$2,$B$2<W$24,$B$3=$A$9,$B$4=T23),V28*$B$2,0)","v":0},{"$f":"IF(AND(W$24<=$B$2,$B$2<X$24,$B$3=$A$9,$B$4=T23),W28*$B$2,0)","v":0},{"$f":"IF(AND(X$24<=$B$2,$B$2<Y$24,$B$3=$A$9,$B$4=T23),X28*$B$2,0)","v":0},{"$f":"IF(AND(Y$24<=$B$2,$B$2<Z$24,$B$3=$A$9,$B$4=T23),Y28*$B$2,0)","v":0},{"$f":"IF(AND(Z$24<=$B$2,$B$3=$A$9,$B$4=T23),Z28*$B$2,0)","v":0},null,24,0,{"$f":"IF(AND(AD$24<=$B$2,$B$2<AE$24,$B$3=$A$9,$B$4=AB23),AD28*$B$2,0)","v":0},{"$f":"IF(AND(AE$24<=$B$2,$B$2<AF$24,$B$3=$A$9,$B$4=AB23),AE28*$B$2,0)","v":0},{"$f":"IF(AND(AF$24<=$B$2,$B$2<AG$24,$B$3=$A$9,$B$4=AB23),AF28*$B$2,0)","v":0},{"$f":"IF(AND(AG$24<=$B$2,$B$2<AH$24,$B$3=$A$9,$B$4=AB23),AG28*$B$2,0)","v":0},{"$f":"IF(AND(AH$24<=$B$2,$B$3=$A$9,$B$4=AB23),AH28*$B$2,0)","v":0},null,24,0,{"$f":"IF(AND(AL$24<=$B$2,$B$2<AM$24,$B$3=$A$9,$B$4=AJ23),AL28*$B$2,0)","v":0},{"$f":"IF(AND(AM$24<=$B$2,$B$2<AN$24,$B$3=$A$9,$B$4=AJ23),AM28*$B$2,0)","v":0},{"$f":"IF(AND(AN$24<=$B$2,$B$2<AO$24,$B$3=$A$9,$B$4=AJ23),AN28*$B$2,0)","v":0},{"$f":"IF(AND(AO$24<=$B$2,$B$2<AP$24,$B$3=$A$9,$B$4=AJ23),AO28*$B$2,0)","v":0},{"$f":"IF(AND(AP$24<=$B$2,$B$3=$A$9,$B$4=AJ23),AP28*$B$2,0)","v":0},null,24,0,{"$f":"IF(AND(AT$24<=$B$2,$B$2<AU$24,$B$3=$A$9,$B$4=AR23),AT28*$B$2,0)","v":0},{"$f":"IF(AND(AU$24<=$B$2,$B$2<AV$24,$B$3=$A$9,$B$4=AR23),AU28*$B$2,0)","v":0},{"$f":"IF(AND(AV$24<=$B$2,$B$2<AW$24,$B$3=$A$9,$B$4=AR23),AV28*$B$2,0)","v":0},{"$f":"IF(AND(AW$24<=$B$2,$B$2<AX$24,$B$3=$A$9,$B$4=AR23),AW28*$B$2,0)","v":0},{"$f":"IF(AND(AX$24<=$B$2,$B$3=$A$9,$B$4=AR23),AX28*$B$2,0)","v":0},null,24,0,{"$f":"IF(AND(BB$24<=$B$2,$B$2<BC$24,$B$3=$A$9,$B$4=AZ23),BB28*$B$2,0)","v":0},{"$f":"IF(AND(BC$24<=$B$2,$B$2<BD$24,$B$3=$A$9,$B$4=AZ23),BC28*$B$2,0)","v":0},{"$f":"IF(AND(BD$24<=$B$2,$B$2<BE$24,$B$3=$A$9,$B$4=AZ23),BD28*$B$2,0)","v":0},{"$f":"IF(AND(BE$24<=$B$2,$B$2<BF$24,$B$3=$A$9,$B$4=AZ23),BE28*$B$2,0)","v":0},{"$f":"IF(AND(BF$24<=$B$2,$B$3=$A$9,$B$4=AZ23),BF28*$B$2,0)","v":0},null,24,0,{"$f":"IF(AND(BJ$24<=$B$2,$B$2<BK$24,$B$3=$A$9,$B$4=BH23),BJ28*$B$2,0)","v":0},{"$f":"IF(AND(BK$24<=$B$2,$B$2<BL$24,$B$3=$A$9,$B$4=BH23),BK28*$B$2,0)","v":0},{"$f":"IF(AND(BL$24<=$B$2,$B$2<BM$24,$B$3=$A$9,$B$4=BH23),BL28*$B$2,0)","v":0},{"$f":"IF(AND(BM$24<=$B$2,$B$2<BN$24,$B$3=$A$9,$B$4=BH23),BM28*$B$2,0)","v":0},{"$f":"IF(AND(BN$24<=$B$2,$B$3=$A$9,$B$4=BH23),BN28*$B$2,0)","v":0},null,12,0,{"$f":"IF(AND(BR$3<=$B$2,$B$3=$A$8,$B$4=BP23),BR28*$B$2,0)","v":0},null,24,0,{"$f":"IF(AND(BV$24<=$B$2,$B$2<BW$24,$B$3=$A$9,$B$4=BT23),BV28*$B$2,0)","v":0},{"$f":"IF(AND(BW$24<=$B$2,$B$2<BX$24,$B$3=$A$9,$B$4=BT23),BW28*$B$2,0)","v":0},{"$f":"IF(AND(BX$24<=$B$2,$B$2<BY$24,$B$3=$A$9,$B$4=BT23),BX28*$B$2,0)","v":0},{"$f":"IF(AND(BY$24<=$B$2,$B$2<BZ$24,$B$3=$A$9,$B$4=BT23),BY28*$B$2,0)","v":0},{"$f":"IF(AND(BZ$24<=$B$2,$B$3=$A$9,$B$4=BT23),BZ28*$B$2,0)","v":0},null,24,0,{"$f":"IF(AND(CD$24<=$B$2,$B$2<CE$24,$B$3=$A$9,$B$4=CB23),CD28*$B$2,0)","v":0},{"$f":"IF(AND(CE$24<=$B$2,$B$2<CF$24,$B$3=$A$9,$B$4=CB23),CE28*$B$2,0)","v":0},{"$f":"IF(AND(CF$24<=$B$2,$B$2<CG$24,$B$3=$A$9,$B$4=CB23),CF28*$B$2,0)","v":0},{"$f":"IF(AND(CG$24<=$B$2,$B$2<CH$24,$B$3=$A$9,$B$4=CB23),CG28*$B$2,0)","v":0},{"$f":"IF(AND(CH$24<=$B$2,$B$3=$A$9,$B$4=CB23),CH28*$B$2,0)","v":0},null,24,0,{"$f":"IF(AND(CL$24<=$B$2,$B$2<CM$24,$B$3=$A$9,$B$4=CJ23),CL28*$B$2,0)","v":0},{"$f":"IF(AND(CM$24<=$B$2,$B$2<CN$24,$B$3=$A$9,$B$4=CJ23),CM28*$B$2,0)","v":0},{"$f":"IF(AND(CN$24<=$B$2,$B$2<CO$24,$B$3=$A$9,$B$4=CJ23),CN28*$B$2,0)","v":0},{"$f":"IF(AND(CO$24<=$B$2,$B$2<CP$24,$B$3=$A$9,$B$4=CJ23),CO28*$B$2,0)","v":0},{"$f":"IF(AND(CP$24<=$B$2,$B$3=$A$9,$B$4=CJ23),CP28*$B$2,0)","v":0},null,24,0,{"$f":"IF(AND(CT$24<=$B$2,$B$2<CU$24,$B$3=$A$9,$B$4=CR23),CT28*$B$2,0)","v":0},{"$f":"IF(AND(CU$24<=$B$2,$B$2<CV$24,$B$3=$A$9,$B$4=CR23),CU28*$B$2,0)","v":0},{"$f":"IF(AND(CV$24<=$B$2,$B$2<CW$24,$B$3=$A$9,$B$4=CR23),CV28*$B$2,0)","v":0},{"$f":"IF(AND(CW$24<=$B$2,$B$2<CX$24,$B$3=$A$9,$B$4=CR23),CW28*$B$2,0)","v":0},{"$f":"IF(AND(CX$24<=$B$2,$B$3=$A$9,$B$4=CR23),CX28*$B$2,0)","v":0},null,24,0,{"$f":"IF(AND(DB$24<=$B$2,$B$2<DC$24,$B$3=$A$9,$B$4=CZ23),DB28*$B$2,0)","v":0},{"$f":"IF(AND(DC$24<=$B$2,$B$2<DD$24,$B$3=$A$9,$B$4=CZ23),DC28*$B$2,0)","v":0},{"$f":"IF(AND(DD$24<=$B$2,$B$2<DE$24,$B$3=$A$9,$B$4=CZ23),DD28*$B$2,0)","v":0},{"$f":"IF(AND(DE$24<=$B$2,$B$2<DF$24,$B$3=$A$9,$B$4=CZ23),DE28*$B$2,0)","v":0},{"$f":"IF(AND(DF$24<=$B$2,$B$3=$A$9,$B$4=CZ23),DF28*$B$2,0)","v":0}]
[null,null,"Muni $1 Out Monthly",36,0,{"$f":"IF(AND(F$24<=$B$2,$B$2<G$24,$B$3=$A$10,$B$4=D23),F29*$B$2,0)","v":0},{"$f":"IF(AND(G$24<=$B$2,$B$2<H$24,$B$3=$A$10,$B$4=D23),G29*$B$2,0)","v":0},{"$f":"IF(AND(H$24<=$B$2,$B$2<I$24,$B$3=$A$10,$B$4=D23),H29*$B$2,0)","v":0},{"$f":"IF(AND(I$24<=$B$2,$B$2<J$24,$B$3=$A$10,$B$4=D23),I29*$B$2,0)","v":0},{"$f":"IF(AND(J$24<=$B$2,$B$3=$A$10,$B$4=D23),J29*$B$2,0)","v":0},null,36,0,{"$f":"IF(AND(N$24<=$B$2,$B$2<O$24,$B$3=$A$10,$B$4=L23),N29*$B$2,0)","v":0},{"$f":"IF(AND(O$24<=$B$2,$B$2<P$24,$B$3=$A$10,$B$4=L23),O29*$B$2,0)","v":0},{"$f":"IF(AND(P$24<=$B$2,$B$2<Q$24,$B$3=$A$10,$B$4=L23),P29*$B$2,0)","v":0},{"$f":"IF(AND(Q$24<=$B$2,$B$2<R$24,$B$3=$A$10,$B$4=L23),Q29*$B$2,0)","v":0},{"$f":"IF(AND(R$24<=$B$2,$B$3=$A$10,$B$4=L23),R29*$B$2,0)","v":0},null,36,0,{"$f":"IF(AND(V$24<=$B$2,$B$2<W$24,$B$3=$A$10,$B$4=T23),V29*$B$2,0)","v":0},{"$f":"IF(AND(W$24<=$B$2,$B$2<X$24,$B$3=$A$10,$B$4=T23),W29*$B$2,0)","v":0},{"$f":"IF(AND(X$24<=$B$2,$B$2<Y$24,$B$3=$A$10,$B$4=T23),X29*$B$2,0)","v":0},{"$f":"IF(AND(Y$24<=$B$2,$B$2<Z$24,$B$3=$A$10,$B$4=T23),Y29*$B$2,0)","v":0},{"$f":"IF(AND(Z$24<=$B$2,$B$3=$A$10,$B$4=T23),Z29*$B$2,0)","v":0},null,36,0,{"$f":"IF(AND(AD$24<=$B$2,$B$2<AE$24,$B$3=$A$10,$B$4=AB23),AD29*$B$2,0)","v":0},{"$f":"IF(AND(AE$24<=$B$2,$B$2<AF$24,$B$3=$A$10,$B$4=AB23),AE29*$B$2,0)","v":0},{"$f":"IF(AND(AF$24<=$B$2,$B$2<AG$24,$B$3=$A$10,$B$4=AB23),AF29*$B$2,0)","v":0},{"$f":"IF(AND(AG$24<=$B$2,$B$2<AH$24,$B$3=$A$10,$B$4=AB23),AG29*$B$2,0)","v":0},{"$f":"IF(AND(AH$24<=$B$2,$B$3=$A$10,$B$4=AB23),AH29*$B$2,0)","v":0},null,36,0,{"$f":"IF(AND(AL$24<=$B$2,$B$2<AM$24,$B$3=$A$10,$B$4=AJ23),AL29*$B$2,0)","v":0},{"$f":"IF(AND(AM$24<=$B$2,$B$2<AN$24,$B$3=$A$10,$B$4=AJ23),AM29*$B$2,0)","v":0},{"$f":"IF(AND(AN$24<=$B$2,$B$2<AO$24,$B$3=$A$10,$B$4=AJ23),AN29*$B$2,0)","v":0},{"$f":"IF(AND(AO$24<=$B$2,$B$2<AP$24,$B$3=$A$10,$B$4=AJ23),AO29*$B$2,0)","v":0},{"$f":"IF(AND(AP$24<=$B$2,$B$3=$A$10,$B$4=AJ23),AP29*$B$2,0)","v":0},null,36,0,{"$f":"IF(AND(AT$24<=$B$2,$B$2<AU$24,$B$3=$A$10,$B$4=AR23),AT29*$B$2,0)","v":0},{"$f":"IF(AND(AU$24<=$B$2,$B$2<AV$24,$B$3=$A$10,$B$4=AR23),AU29*$B$2,0)","v":0},{"$f":"IF(AND(AV$24<=$B$2,$B$2<AW$24,$B$3=$A$10,$B$4=AR23),AV29*$B$2,0)","v":0},{"$f":"IF(AND(AW$24<=$B$2,$B$2<AX$24,$B$3=$A$10,$B$4=AR23),AW29*$B$2,0)","v":0},{"$f":"IF(AND(AX$24<=$B$2,$B$3=$A$10,$B$4=AR23),AX29*$B$2,0)","v":0},null,36,0,{"$f":"IF(AND(BB$24<=$B$2,$B$2<BC$24,$B$3=$A$10,$B$4=AZ23),BB29*$B$2,0)","v":0},{"$f":"IF(AND(BC$24<=$B$2,$B$2<BD$24,$B$3=$A$10,$B$4=AZ23),BC29*$B$2,0)","v":0},{"$f":"IF(AND(BD$24<=$B$2,$B$2<BE$24,$B$3=$A$10,$B$4=AZ23),BD29*$B$2,0)","v":0},{"$f":"IF(AND(BE$24<=$B$2,$B$2<BF$24,$B$3=$A$10,$B$4=AZ23),BE29*$B$2,0)","v":0},{"$f":"IF(AND(BF$24<=$B$2,$B$3=$A$10,$B$4=AZ23),BF29*$B$2,0)","v":0},null,36,0,{"$f":"IF(AND(BJ$24<=$B$2,$B$2<BK$24,$B$3=$A$10,$B$4=BH23),BJ29*$B$2,0)","v":0},{"$f":"IF(AND(BK$24<=$B$2,$B$2<BL$24,$B$3=$A$10,$B$4=BH23),BK29*$B$2,0)","v":0},{"$f":"IF(AND(BL$24<=$B$2,$B$2<BM$24,$B$3=$A$10,$B$4=BH23),BL29*$B$2,0)","v":0},{"$f":"IF(AND(BM$24<=$B$2,$B$2<BN$24,$B$3=$A$10,$B$4=BH23),BM29*$B$2,0)","v":0},{"$f":"IF(AND(BN$24<=$B$2,$B$3=$A$10,$B$4=BH23),BN29*$B$2,0)","v":0},null,18,0,{"$f":"IF(AND(BR$3<=$B$2,$B$3=$A$14,$B$4=BP23),BR29*$B$2,0)","v":0},null,36,0,{"$f":"IF(AND(BV$24<=$B$2,$B$2<BW$24,$B$3=$A$10,$B$4=BT23),BV29*$B$2,0)","v":0},{"$f":"IF(AND(BW$24<=$B$2,$B$2<BX$24,$B$3=$A$10,$B$4=BT23),BW29*$B$2,0)","v":0},{"$f":"IF(AND(BX$24<=$B$2,$B$2<BY$24,$B$3=$A$10,$B$4=BT23),BX29*$B$2,0)","v":0},{"$f":"IF(AND(BY$24<=$B$2,$B$2<BZ$24,$B$3=$A$10,$B$4=BT23),BY29*$B$2,0)","v":0},{"$f":"IF(AND(BZ$24<=$B$2,$B$3=$A$10,$B$4=BT23),BZ29*$B$2,0)","v":0},null,36,0,{"$f":"IF(AND(CD$24<=$B$2,$B$2<CE$24,$B$3=$A$10,$B$4=CB23),CD29*$B$2,0)","v":0},{"$f":"IF(AND(CE$24<=$B$2,$B$2<CF$24,$B$3=$A$10,$B$4=CB23),CE29*$B$2,0)","v":0},{"$f":"IF(AND(CF$24<=$B$2,$B$2<CG$24,$B$3=$A$10,$B$4=CB23),CF29*$B$2,0)","v":0},{"$f":"IF(AND(CG$24<=$B$2,$B$2<CH$24,$B$3=$A$10,$B$4=CB23),CG29*$B$2,0)","v":0},{"$f":"IF(AND(CH$24<=$B$2,$B$3=$A$10,$B$4=CB23),CH29*$B$2,0)","v":0},null,36,0,{"$f":"IF(AND(CL$24<=$B$2,$B$2<CM$24,$B$3=$A$10,$B$4=CJ23),CL29*$B$2,0)","v":0},{"$f":"IF(AND(CM$24<=$B$2,$B$2<CN$24,$B$3=$A$10,$B$4=CJ23),CM29*$B$2,0)","v":0},{"$f":"IF(AND(CN$24<=$B$2,$B$2<CO$24,$B$3=$A$10,$B$4=CJ23),CN29*$B$2,0)","v":0},{"$f":"IF(AND(CO$24<=$B$2,$B$2<CP$24,$B$3=$A$10,$B$4=CJ23),CO29*$B$2,0)","v":0},{"$f":"IF(AND(CP$24<=$B$2,$B$3=$A$10,$B$4=CJ23),CP29*$B$2,0)","v":0},null,36,0,{"$f":"IF(AND(CT$24<=$B$2,$B$2<CU$24,$B$3=$A$10,$B$4=CR23),CT29*$B$2,0)","v":0},{"$f":"IF(AND(CU$24<=$B$2,$B$2<CV$24,$B$3=$A$10,$B$4=CR23),CU29*$B$2,0)","v":0},{"$f":"IF(AND(CV$24<=$B$2,$B$2<CW$24,$B$3=$A$10,$B$4=CR23),CV29*$B$2,0)","v":0},{"$f":"IF(AND(CW$24<=$B$2,$B$2<CX$24,$B$3=$A$10,$B$4=CR23),CW29*$B$2,0)","v":0},{"$f":"IF(AND(CX$24<=$B$2,$B$3=$A$10,$B$4=CR23),CX29*$B$2,0)","v":0},null,36,0,{"$f":"IF(AND(DB$24<=$B$2,$B$2<DC$24,$B$3=$A$10,$B$4=CZ23),DB29*$B$2,0)","v":0},{"$f":"IF(AND(DC$24<=$B$2,$B$2<DD$24,$B$3=$A$10,$B$4=CZ23),DC29*$B$2,0)","v":0},{"$f":"IF(AND(DD$24<=$B$2,$B$2<DE$24,$B$3=$A$10,$B$4=CZ23),DD29*$B$2,0)","v":0},{"$f":"IF(AND(DE$24<=$B$2,$B$2<DF$24,$B$3=$A$10,$B$4=CZ23),DE29*$B$2,0)","v":0},{"$f":"IF(AND(DF$24<=$B$2,$B$3=$A$10,$B$4=CZ23),DF29*$B$2,0)","v":0}]
[null,null,"Muni $1 Out Quarterly",48,0,{"$f":"IF(AND(F$24<=$B$2,$B$2<G$24,$B$3=$A$11,$B$4=D23),F30*$B$2,0)","v":0},{"$f":"IF(AND(G$24<=$B$2,$B$2<H$24,$B$3=$A$11,$B$4=D23),G30*$B$2,0)","v":0},{"$f":"IF(AND(H$24<=$B$2,$B$2<I$24,$B$3=$A$11,$B$4=D23),H30*$B$2,0)","v":0},{"$f":"IF(AND(I$24<=$B$2,$B$2<J$24,$B$3=$A$11,$B$4=D23),I30*$B$2,0)","v":0},{"$f":"IF(AND(J$24<=$B$2,$B$3=$A$11,$B$4=D23),J30*$B$2,0)","v":0},null,48,0,{"$f":"IF(AND(N$24<=$B$2,$B$2<O$24,$B$3=$A$11,$B$4=L23),N30*$B$2,0)","v":0},{"$f":"IF(AND(O$24<=$B$2,$B$2<P$24,$B$3=$A$11,$B$4=L23),O30*$B$2,0)","v":0},{"$f":"IF(AND(P$24<=$B$2,$B$2<Q$24,$B$3=$A$11,$B$4=L23),P30*$B$2,0)","v":0},{"$f":"IF(AND(Q$24<=$B$2,$B$2<R$24,$B$3=$A$11,$B$4=L23),Q30*$B$2,0)","v":0},{"$f":"IF(AND(R$24<=$B$2,$B$3=$A$11,$B$4=L23),R30*$B$2,0)","v":0},null,48,0,{"$f":"IF(AND(V$24<=$B$2,$B$2<W$24,$B$3=$A$11,$B$4=T23),V30*$B$2,0)","v":0},{"$f":"IF(AND(W$24<=$B$2,$B$2<X$24,$B$3=$A$11,$B$4=T23),W30*$B$2,0)","v":0},{"$f":"IF(AND(X$24<=$B$2,$B$2<Y$24,$B$3=$A$11,$B$4=T23),X30*$B$2,0)","v":0},{"$f":"IF(AND(Y$24<=$B$2,$B$2<Z$24,$B$3=$A$11,$B$4=T23),Y30*$B$2,0)","v":0},{"$f":"IF(AND(Z$24<=$B$2,$B$3=$A$11,$B$4=T23),Z30*$B$2,0)","v":0},null,48,0,{"$f":"IF(AND(AD$24<=$B$2,$B$2<AE$24,$B$3=$A$11,$B$4=AB23),AD30*$B$2,0)","v":0},{"$f":"IF(AND(AE$24<=$B$2,$B$2<AF$24,$B$3=$A$11,$B$4=AB23),AE30*$B$2,0)","v":0},{"$f":"IF(AND(AF$24<=$B$2,$B$2<AG$24,$B$3=$A$11,$B$4=AB23),AF30*$B$2,0)","v":0},{"$f":"IF(AND(AG$24<=$B$2,$B$2<AH$24,$B$3=$A$11,$B$4=AB23),AG30*$B$2,0)","v":0},{"$f":"IF(AND(AH$24<=$B$2,$B$3=$A$11,$B$4=AB23),AH30*$B$2,0)","v":0},null,48,0,{"$f":"IF(AND(AL$24<=$B$2,$B$2<AM$24,$B$3=$A$11,$B$4=AJ23),AL30*$B$2,0)","v":0},{"$f":"IF(AND(AM$24<=$B$2,$B$2<AN$24,$B$3=$A$11,$B$4=AJ23),AM30*$B$2,0)","v":0},{"$f":"IF(AND(AN$24<=$B$2,$B$2<AO$24,$B$3=$A$11,$B$4=AJ23),AN30*$B$2,0)","v":0},{"$f":"IF(AND(AO$24<=$B$2,$B$2<AP$24,$B$3=$A$11,$B$4=AJ23),AO30*$B$2,0)","v":0},{"$f":"IF(AND(AP$24<=$B$2,$B$3=$A$11,$B$4=AJ23),AP30*$B$2,0)","v":0},null,48,0,{"$f":"IF(AND(AT$24<=$B$2,$B$2<AU$24,$B$3=$A$11,$B$4=AR23),AT30*$B$2,0)","v":0},{"$f":"IF(AND(AU$24<=$B$2,$B$2<AV$24,$B$3=$A$11,$B$4=AR23),AU30*$B$2,0)","v":0},{"$f":"IF(AND(AV$24<=$B$2,$B$2<AW$24,$B$3=$A$11,$B$4=AR23),AV30*$B$2,0)","v":0},{"$f":"IF(AND(AW$24<=$B$2,$B$2<AX$24,$B$3=$A$11,$B$4=AR23),AW30*$B$2,0)","v":0},{"$f":"IF(AND(AX$24<=$B$2,$B$3=$A$11,$B$4=AR23),AX30*$B$2,0)","v":0},null,48,0,{"$f":"IF(AND(BB$24<=$B$2,$B$2<BC$24,$B$3=$A$11,$B$4=AZ23),BB30*$B$2,0)","v":0},{"$f":"IF(AND(BC$24<=$B$2,$B$2<BD$24,$B$3=$A$11,$B$4=AZ23),BC30*$B$2,0)","v":0},{"$f":"IF(AND(BD$24<=$B$2,$B$2<BE$24,$B$3=$A$11,$B$4=AZ23),BD30*$B$2,0)","v":0},{"$f":"IF(AND(BE$24<=$B$2,$B$2<BF$24,$B$3=$A$11,$B$4=AZ23),BE30*$B$2,0)","v":0},{"$f":"IF(AND(BF$24<=$B$2,$B$3=$A$11,$B$4=AZ23),BF30*$B$2,0)","v":0},null,48,0,{"$f":"IF(AND(BJ$24<=$B$2,$B$2<BK$24,$B$3=$A$11,$B$4=BH23),BJ30*$B$2,0)","v":0},{"$f":"IF(AND(BK$24<=$B$2,$B$2<BL$24,$B$3=$A$11,$B$4=BH23),BK30*$B$2,0)","v":0},{"$f":"IF(AND(BL$24<=$B$2,$B$2<BM$24,$B$3=$A$11,$B$4=BH23),BL30*$B$2,0)","v":0},{"$f":"IF(AND(BM$24<=$B$2,$B$2<BN$24,$B$3=$A$11,$B$4=BH23),BM30*$B$2,0)","v":0},{"$f":"IF(AND(BN$24<=$B$2,$B$3=$A$11,$B$4=BH23),BN30*$B$2,0)","v":0},null,null,null,null,null,48,0,{"$f":"IF(AND(BV$24<=$B$2,$B$2<BW$24,$B$3=$A$11,$B$4=BT23),BV30*$B$2,0)","v":0},{"$f":"IF(AND(BW$24<=$B$2,$B$2<BX$24,$B$3=$A$11,$B$4=BT23),BW30*$B$2,0)","v":0},{"$f":"IF(AND(BX$24<=$B$2,$B$2<BY$24,$B$3=$A$11,$B$4=BT23),BX30*$B$2,0)","v":0},{"$f":"IF(AND(BY$24<=$B$2,$B$2<BZ$24,$B$3=$A$11,$B$4=BT23),BY30*$B$2,0)","v":0},{"$f":"IF(AND(BZ$24<=$B$2,$B$3=$A$11,$B$4=BT23),BZ30*$B$2,0)","v":0},null,48,0,{"$f":"IF(AND(CD$24<=$B$2,$B$2<CE$24,$B$3=$A$11,$B$4=CB23),CD30*$B$2,0)","v":0},{"$f":"IF(AND(CE$24<=$B$2,$B$2<CF$24,$B$3=$A$11,$B$4=CB23),CE30*$B$2,0)","v":0},{"$f":"IF(AND(CF$24<=$B$2,$B$2<CG$24,$B$3=$A$11,$B$4=CB23),CF30*$B$2,0)","v":0},{"$f":"IF(AND(CG$24<=$B$2,$B$2<CH$24,$B$3=$A$11,$B$4=CB23),CG30*$B$2,0)","v":0},{"$f":"IF(AND(CH$24<=$B$2,$B$3=$A$11,$B$4=CB23),CH30*$B$2,0)","v":0},null,48,0,{"$f":"IF(AND(CL$24<=$B$2,$B$2<CM$24,$B$3=$A$11,$B$4=CJ23),CL30*$B$2,0)","v":0},{"$f":"IF(AND(CM$24<=$B$2,$B$2<CN$24,$B$3=$A$11,$B$4=CJ23),CM30*$B$2,0)","v":0},{"$f":"IF(AND(CN$24<=$B$2,$B$2<CO$24,$B$3=$A$11,$B$4=CJ23),CN30*$B$2,0)","v":0},{"$f":"IF(AND(CO$24<=$B$2,$B$2<CP$24,$B$3=$A$11,$B$4=CJ23),CO30*$B$2,0)","v":0},{"$f":"IF(AND(CP$24<=$B$2,$B$3=$A$11,$B$4=CJ23),CP30*$B$2,0)","v":0},null,48,0,{"$f":"IF(AND(CT$24<=$B$2,$B$2<CU$24,$B$3=$A$11,$B$4=CR23),CT30*$B$2,0)","v":0},{"$f":"IF(AND(CU$24<=$B$2,$B$2<CV$24,$B$3=$A$11,$B$4=CR23),CU30*$B$2,0)","v":0},{"$f":"IF(AND(CV$24<=$B$2,$B$2<CW$24,$B$3=$A$11,$B$4=CR23),CV30*$B$2,0)","v":0},{"$f":"IF(AND(CW$24<=$B$2,$B$2<CX$24,$B$3=$A$11,$B$4=CR23),CW30*$B$2,0)","v":0},{"$f":"IF(AND(CX$24<=$B$2,$B$3=$A$11,$B$4=CR23),CX30*$B$2,0)","v":0},null,48,0,{"$f":"IF(AND(DB$24<=$B$2,$B$2<DC$24,$B$3=$A$11,$B$4=CZ23),DB30*$B$2,0)","v":0},{"$f":"IF(AND(DC$24<=$B$2,$B$2<DD$24,$B$3=$A$11,$B$4=CZ23),DC30*$B$2,0)","v":0},{"$f":"IF(AND(DD$24<=$B$2,$B$2<DE$24,$B$3=$A$11,$B$4=CZ23),DD30*$B$2,0)","v":0},{"$f":"IF(AND(DE$24<=$B$2,$B$2<DF$24,$B$3=$A$11,$B$4=CZ23),DE30*$B$2,0)","v":0},{"$f":"IF(AND(DF$24<=$B$2,$B$3=$A$11,$B$4=CZ23),DF30*$B$2,0)","v":0}]
["Change this Quarter when have new rates.",null,"Muni $1 Out Semi-Annually",60,0,{"$f":"IF(AND(F$24<=$B$2,$B$2<G$24,$B$3=$A$12,$B$4=D23),F31*$B$2,0)","v":0},{"$f":"IF(AND(G$24<=$B$2,$B$2<H$24,$B$3=$A$12,$B$4=D23),G31*$B$2,0)","v":0},{"$f":"IF(AND(H$24<=$B$2,$B$2<I$24,$B$3=$A$12,$B$4=D23),H31*$B$2,0)","v":0},{"$f":"IF(AND(I$24<=$B$2,$B$2<J$24,$B$3=$A$12,$B$4=D23),I31*$B$2,0)","v":0},{"$f":"IF(AND(J$24<=$B$2,$B$3=$A$12,$B$4=D23),J31*$B$2,0)","v":0},null,60,0,{"$f":"IF(AND(N$24<=$B$2,$B$2<O$24,$B$3=$A$12,$B$4=L23),N31*$B$2,0)","v":0},{"$f":"IF(AND(O$24<=$B$2,$B$2<P$24,$B$3=$A$12,$B$4=L23),O31*$B$2,0)","v":0},{"$f":"IF(AND(P$24<=$B$2,$B$2<Q$24,$B$3=$A$12,$B$4=L23),P31*$B$2,0)","v":0},{"$f":"IF(AND(Q$24<=$B$2,$B$2<R$24,$B$3=$A$12,$B$4=L23),Q31*$B$2,0)","v":0},{"$f":"IF(AND(R$24<=$B$2,$B$3=$A$12,$B$4=L23),R31*$B$2,0)","v":0},null,60,0,{"$f":"IF(AND(V$24<=$B$2,$B$2<W$24,$B$3=$A$12,$B$4=T23),V31*$B$2,0)","v":0},{"$f":"IF(AND(W$24<=$B$2,$B$2<X$24,$B$3=$A$12,$B$4=T23),W31*$B$2,0)","v":0},{"$f":"IF(AND(X$24<=$B$2,$B$2<Y$24,$B$3=$A$12,$B$4=T23),X31*$B$2,0)","v":0},{"$f":"IF(AND(Y$24<=$B$2,$B$2<Z$24,$B$3=$A$12,$B$4=T23),Y31*$B$2,0)","v":0},{"$f":"IF(AND(Z$24<=$B$2,$B$3=$A$12,$B$4=T23),Z31*$B$2,0)","v":0},null,60,0,{"$f":"IF(AND(AD$24<=$B$2,$B$2<AE$24,$B$3=$A$12,$B$4=AB23),AD31*$B$2,0)","v":0},{"$f":"IF(AND(AE$24<=$B$2,$B$2<AF$24,$B$3=$A$12,$B$4=AB23),AE31*$B$2,0)","v":0},{"$f":"IF(AND(AF$24<=$B$2,$B$2<AG$24,$B$3=$A$12,$B$4=AB23),AF31*$B$2,0)","v":0},{"$f":"IF(AND(AG$24<=$B$2,$B$2<AH$24,$B$3=$A$12,$B$4=AB23),AG31*$B$2,0)","v":0},{"$f":"IF(AND(AH$24<=$B$2,$B$3=$A$12,$B$4=AB23),AH31*$B$2,0)","v":0},null,60,0,{"$f":"IF(AND(AL$24<=$B$2,$B$2<AM$24,$B$3=$A$12,$B$4=AJ23),AL31*$B$2,0)","v":0},{"$f":"IF(AND(AM$24<=$B$2,$B$2<AN$24,$B$3=$A$12,$B$4=AJ23),AM31*$B$2,0)","v":0},{"$f":"IF(AND(AN$24<=$B$2,$B$2<AO$24,$B$3=$A$12,$B$4=AJ23),AN31*$B$2,0)","v":0},{"$f":"IF(AND(AO$24<=$B$2,$B$2<AP$24,$B$3=$A$12,$B$4=AJ23),AO31*$B$2,0)","v":0},{"$f":"IF(AND(AP$24<=$B$2,$B$3=$A$12,$B$4=AJ23),AP31*$B$2,0)","v":0},null,60,0,{"$f":"IF(AND(AT$24<=$B$2,$B$2<AU$24,$B$3=$A$12,$B$4=AR23),AT31*$B$2,0)","v":0},{"$f":"IF(AND(AU$24<=$B$2,$B$2<AV$24,$B$3=$A$12,$B$4=AR23),AU31*$B$2,0)","v":0},{"$f":"IF(AND(AV$24<=$B$2,$B$2<AW$24,$B$3=$A$12,$B$4=AR23),AV31*$B$2,0)","v":0},{"$f":"IF(AND(AW$24<=$B$2,$B$2<AX$24,$B$3=$A$12,$B$4=AR23),AW31*$B$2,0)","v":0},{"$f":"IF(AND(AX$24<=$B$2,$B$3=$A$12,$B$4=AR23),AX31*$B$2,0)","v":0},null,60,0,{"$f":"IF(AND(BB$24<=$B$2,$B$2<BC$24,$B$3=$A$12,$B$4=AZ23),BB31*$B$2,0)","v":0},{"$f":"IF(AND(BC$24<=$B$2,$B$2<BD$24,$B$3=$A$12,$B$4=AZ23),BC31*$B$2,0)","v":0},{"$f":"IF(AND(BD$24<=$B$2,$B$2<BE$24,$B$3=$A$12,$B$4=AZ23),BD31*$B$2,0)","v":0},{"$f":"IF(AND(BE$24<=$B$2,$B$2<BF$24,$B$3=$A$12,$B$4=AZ23),BE31*$B$2,0)","v":0},{"$f":"IF(AND(BF$24<=$B$2,$B$3=$A$12,$B$4=AZ23),BF31*$B$2,0)","v":0},null,60,0,{"$f":"IF(AND(BJ$24<=$B$2,$B$2<BK$24,$B$3=$A$12,$B$4=BH23),BJ31*$B$2,0)","v":0},{"$f":"IF(AND(BK$24<=$B$2,$B$2<BL$24,$B$3=$A$12,$B$4=BH23),BK31*$B$2,0)","v":0},{"$f":"IF(AND(BL$24<=$B$2,$B$2<BM$24,$B$3=$A$12,$B$4=BH23),BL31*$B$2,0)","v":0},{"$f":"IF(AND(BM$24<=$B$2,$B$2<BN$24,$B$3=$A$12,$B$4=BH23),BM31*$B$2,0)","v":0},{"$f":"IF(AND(BN$24<=$B$2,$B$3=$A$12,$B$4=BH23),BN31*$B$2,0)","v":0},null,null,null,null,null,60,0,{"$f":"IF(AND(BV$24<=$B$2,$B$2<BW$24,$B$3=$A$12,$B$4=BT23),BV31*$B$2,0)","v":0},{"$f":"IF(AND(BW$24<=$B$2,$B$2<BX$24,$B$3=$A$12,$B$4=BT23),BW31*$B$2,0)","v":0},{"$f":"IF(AND(BX$24<=$B$2,$B$2<BY$24,$B$3=$A$12,$B$4=BT23),BX31*$B$2,0)","v":0},{"$f":"IF(AND(BY$24<=$B$2,$B$2<BZ$24,$B$3=$A$12,$B$4=BT23),BY31*$B$2,0)","v":0},{"$f":"IF(AND(BZ$24<=$B$2,$B$3=$A$12,$B$4=BT23),BZ31*$B$2,0)","v":0},null,60,0,{"$f":"IF(AND(CD$24<=$B$2,$B$2<CE$24,$B$3=$A$12,$B$4=CB23),CD31*$B$2,0)","v":0},{"$f":"IF(AND(CE$24<=$B$2,$B$2<CF$24,$B$3=$A$12,$B$4=CB23),CE31*$B$2,0)","v":0},{"$f":"IF(AND(CF$24<=$B$2,$B$2<CG$24,$B$3=$A$12,$B$4=CB23),CF31*$B$2,0)","v":0},{"$f":"IF(AND(CG$24<=$B$2,$B$2<CH$24,$B$3=$A$12,$B$4=CB23),CG31*$B$2,0)","v":0},{"$f":"IF(AND(CH$24<=$B$2,$B$3=$A$12,$B$4=CB23),CH31*$B$2,0)","v":0},null,60,0,{"$f":"IF(AND(CL$24<=$B$2,$B$2<CM$24,$B$3=$A$12,$B$4=CJ23),CL31*$B$2,0)","v":0},{"$f":"IF(AND(CM$24<=$B$2,$B$2<CN$24,$B$3=$A$12,$B$4=CJ23),CM31*$B$2,0)","v":0},{"$f":"IF(AND(CN$24<=$B$2,$B$2<CO$24,$B$3=$A$12,$B$4=CJ23),CN31*$B$2,0)","v":0},{"$f":"IF(AND(CO$24<=$B$2,$B$2<CP$24,$B$3=$A$12,$B$4=CJ23),CO31*$B$2,0)","v":0},{"$f":"IF(AND(CP$24<=$B$2,$B$3=$A$12,$B$4=CJ23),CP31*$B$2,0)","v":0},null,60,0,{"$f":"IF(AND(CT$24<=$B$2,$B$2<CU$24,$B$3=$A$12,$B$4=CR23),CT31*$B$2,0)","v":0},{"$f":"IF(AND(CU$24<=$B$2,$B$2<CV$24,$B$3=$A$12,$B$4=CR23),CU31*$B$2,0)","v":0},{"$f":"IF(AND(CV$24<=$B$2,$B$2<CW$24,$B$3=$A$12,$B$4=CR23),CV31*$B$2,0)","v":0},{"$f":"IF(AND(CW$24<=$B$2,$B$2<CX$24,$B$3=$A$12,$B$4=CR23),CW31*$B$2,0)","v":0},{"$f":"IF(AND(CX$24<=$B$2,$B$3=$A$12,$B$4=CR23),CX31*$B$2,0)","v":0},null,60,0,{"$f":"IF(AND(DB$24<=$B$2,$B$2<DC$24,$B$3=$A$12,$B$4=CZ23),DB31*$B$2,0)","v":0},{"$f":"IF(AND(DC$24<=$B$2,$B$2<DD$24,$B$3=$A$12,$B$4=CZ23),DC31*$B$2,0)","v":0},{"$f":"IF(AND(DD$24<=$B$2,$B$2<DE$24,$B$3=$A$12,$B$4=CZ23),DD31*$B$2,0)","v":0},{"$f":"IF(AND(DE$24<=$B$2,$B$2<DF$24,$B$3=$A$12,$B$4=CZ23),DE31*$B$2,0)","v":0},{"$f":"IF(AND(DF$24<=$B$2,$B$3=$A$12,$B$4=CZ23),DF31*$B$2,0)","v":0}]
["Rates 2016 - Rev. 7/1/2016",null,"Muni $1 Out Annually",{"$f":"SUM(F38:DF38)","v":0},null,{"$f":"SUM(F33:F37)","v":0},{"$f":"SUM(G33:G37)","v":0},{"$f":"SUM(H33:H37)","v":0},{"$f":"SUM(I33:I37)","v":0},{"$f":"SUM(J33:J37)","v":0},null,null,null,{"$f":"SUM(N33:N37)","v":0},{"$f":"SUM(O33:O37)","v":0},{"$f":"SUM(P33:P37)","v":0},{"$f":"SUM(Q33:Q37)","v":0},{"$f":"SUM(R33:R37)","v":0},null,null,null,{"$f":"SUM(V33:V37)","v":0},{"$f":"SUM(W33:W37)","v":0},{"$f":"SUM(X33:X37)","v":0},{"$f":"SUM(Y33:Y37)","v":0},{"$f":"SUM(Z33:Z37)","v":0},null,null,null,{"$f":"SUM(AD33:AD37)","v":0},{"$f":"SUM(AE33:AE37)","v":0},{"$f":"SUM(AF33:AF37)","v":0},{"$f":"SUM(AG33:AG37)","v":0},{"$f":"SUM(AH33:AH37)","v":0},null,null,null,{"$f":"SUM(AL33:AL37)","v":0},{"$f":"SUM(AM33:AM37)","v":0},{"$f":"SUM(AN33:AN37)","v":0},{"$f":"SUM(AO33:AO37)","v":0},{"$f":"SUM(AP33:AP37)","v":0},null,null,null,{"$f":"SUM(AT33:AT37)","v":0},{"$f":"SUM(AU33:AU37)","v":0},{"$f":"SUM(AV33:AV37)","v":0},{"$f":"SUM(AW33:AW37)","v":0},{"$f":"SUM(AX33:AX37)","v":0},null,null,null,{"$f":"SUM(BB33:BB37)","v":0},{"$f":"SUM(BC33:BC37)","v":0},{"$f":"SUM(BD33:BD37)","v":0},{"$f":"SUM(BE33:BE37)","v":0},{"$f":"SUM(BF33:BF37)","v":0},null,null,null,{"$f":"SUM(BJ33:BJ37)","v":0},{"$f":"SUM(BK33:BK37)","v":0},{"$f":"SUM(BL33:BL37)","v":0},{"$f":"SUM(BM33:BM37)","v":0},{"$f":"SUM(BN33:BN37)","v":0},null,null,null,{"$f":"SUM(BR33:BR37)","v":0},null,null,null,{"$f":"SUM(BV33:BV37)","v":0},{"$f":"SUM(BW33:BW37)","v":0},{"$f":"SUM(BX33:BX37)","v":0},{"$f":"SUM(BY33:BY37)","v":0},{"$f":"SUM(BZ33:BZ37)","v":0},null,null,null,{"$f":"SUM(CD33:CD37)","v":0},{"$f":"SUM(CE33:CE37)","v":0},{"$f":"SUM(CF33:CF37)","v":0},{"$f":"SUM(CG33:CG37)","v":0},{"$f":"SUM(CH33:CH37)","v":0},null,null,null,{"$f":"SUM(CL33:CL37)","v":0},{"$f":"SUM(CM33:CM37)","v":0},{"$f":"SUM(CN33:CN37)","v":0},{"$f":"SUM(CO33:CO37)","v":0},{"$f":"SUM(CP33:CP37)","v":0},null,null,null,{"$f":"SUM(CT33:CT37)","v":0},{"$f":"SUM(CU33:CU37)","v":0},{"$f":"SUM(CV33:CV37)","v":0},{"$f":"SUM(CW33:CW37)","v":0},{"$f":"SUM(CX33:CX37)","v":0},null,null,null,{"$f":"SUM(DB33:DB37)","v":0},{"$f":"SUM(DC33:DC37)","v":0},{"$f":"SUM(DD33:DD37)","v":0},{"$f":"SUM(DE33:DE37)","v":0},{"$f":"SUM(DF33:DF37)","v":0}]
["“Blank Payment Amounts Indicate The Financing Option Or Purchase Options Selected Are Not "]
["Applicable Or The Machine Total Is Below The Minimum Amount For The Selected Vendor”"]
["\"Quoted monthly payments are estimates only and are based on a certain level of credit rating."]
["Actual monthly payments may be higher depending on your credit rating.\"","Promotion"]
["“Financing rates do not include Pre-Paid Service”","PurchaseOptTCS_Promo","PurchaseOptTFS_Promo"]
[null,"Purchase Opt - TCS","Purchase Opt - TCS"]
[null,"None","None"]
[null,1,1]
[null,"$1.00 - 90 days deferred","$1.00 - 90 days deferred"]
[null,"FMV Sweeper","FMV Sweeper"]
[null,"FMV Sweeper - Promo","FMV Sweeper - Promo"]
[null,"FMV Sweeper - 90 days deferred","FMV Sweeper - 90 days deferred"]
[null,"FMV Scrubber","FMV Scrubber"]
[null,"FMV Scrubber - 90 days deferred","FMV Scrubber - 90 days deferred"]
[null,"10% Option","10% Option"]
[null,"10% PUT","10% PUT"]
[null,"Muni $1 Out Monthly","Muni $1 Out Monthly"]
[null,"Muni $1 Out Quarterly","Muni $1 Out Quarterly"]
[null,"Muni $1 Out Semi-Annually","Muni $1 Out Semi-Annually"]
[null,"Muni $1 Out Annually","Muni $1 Out Annually"]
[null,"Rent To Own","Rent To Own"]